{"text_format":"1","workbook":"xlsx","n_sheets":8,"sheets":["Assessment Details","Simple Scoring Approach","Detailed Scoring Approach","Assessment Data","Assessment References","Ene01 Calibrators - Domestic","Summary of Building Performance","Version Control"],"not_rendered":{"charts":1,"images":3,"macros":1,"external_links":1,"defined_names":1994,"comments":4,"pivot_tables":0},"unopened":[],"bounds":{"document_bytes":16777216,"sheet_cells":100000,"rows_first":2000,"rows_last":500,"rows_between":2000,"halvings":0,"cell_chars":16384,"cell_head_chars":4096},"cells_cut":0,"cells_raw":0,"read":"whole","date_system":"1900"}

{"sheet":"Assessment Details","index":0,"n_rows":414,"n_cols":30,"rows_kept":414,"cut":false,"hidden":false,"merged":[[102,1,102,7],[85,1,85,7],[79,1,79,7],[162,1,162,16],[165,1,165,16],[130,1,130,7],[130,9,130,16],[110,9,110,16],[120,9,120,16],[122,9,122,16],[124,9,124,16],[114,9,114,16],[112,9,112,16],[161,1,161,16],[127,1,127,16],[129,4,129,7],[81,1,81,7],[63,9,63,16],[73,9,73,16],[1,1,1,11],[49,9,49,16],[57,9,57,16],[65,9,65,16],[71,9,71,16],[75,9,75,16],[61,9,61,16],[77,9,77,16],[47,9,47,16],[55,9,55,16],[35,9,35,16],[37,9,37,16],[0,1,0,16],[29,9,29,16],[53,9,53,16],[51,9,51,16],[41,9,41,16],[2,1,3,16],[39,9,39,16],[43,9,43,16],[8,9,8,16],[10,9,10,16],[17,1,17,7],[17,9,17,16],[12,9,12,16],[14,9,14,16],[25,9,25,16],[27,9,27,16],[131,18,131,23],[6,9,6,16],[23,9,23,16],[31,9,31,16],[127,18,127,23],[21,9,21,16],[45,9,45,16],[85,9,85,16],[33,9,33,16],[59,9,59,16],[99,18,104,23],[101,9,101,16],[95,9,95,16],[91,9,91,16],[93,9,93,16],[87,9,87,16],[118,9,118,16],[81,9,81,16],[67,9,67,16],[79,9,79,16],[97,9,97,16],[116,9,116,16],[108,9,108,16],[99,9,99,16],[102,9,102,16],[83,9,83,16],[106,9,106,16],[89,9,89,16],[69,9,69,16]]}
[null,{"$f":"IF(AD_Mandatory_fields_text=AIS_statement09,AIS_statement29,\"\")","v":"Note: If you are starting a new pre-assessment please ensure you are using the latest template version of the BREEAM International 2013 Pre-Assessment tool and not a version used for an existing/previous pre-assessment."}]
[null,{"$f":"IF(OR(projecttype=Z214,projecttype=\"\"),\"BREEAM International 2013 New Construction Pre-Assessment Estimator:                                      Assessment Details\",\"BREEAM International Bespoke 2013 New Construction Pre-Assessment Estimator:                    Assessment Details\")","v":"BREEAM International 2013 New Construction Pre-Assessment Estimator:                                      Assessment Details"}]
[null,{"$f":"IF(AD_Mandatory_fields_check>0,AIS_statement09,\"\")","v":"The fields below marked with a * are mandatory and must be completed/defined prior to beginning the pre-assessment to ensure an accurate indicative score and BREEAM rating. Note: without this information the pre-assessment tool cannot determine the applicable BREEAM issues and number of credits and data entry will not be possible for the building assessment."}]
[]
[null,"General information",null,null,null,null,null,null,null,null,null,null,null,null,null,null,{"$f":"IF(projecttype=Z215,\"BESPOKE\",\"\")","v":""}]
[]
[null,null,null,null,null,null,null,"BRE Assessment reference no.",null,null,null,null,null,null,null,null,null,"*"]
[]
[null,null,null,null,null,null,null,"Client name",null,null,null,null,null,null,null,null,null,"*"]
[]
[null,null,null,null,null,null,null,"Building end user/occupier"]
[]
[null,null,null,null,null,null,null,"Assessor name",null,null,null,null,null,null,null,null,null,"*"]
[]
[null,null,null,null,null,null,null,"Assessor organisation",null,null,null,null,null,null,null,null,null,"*"]
[null,"Pre assessment scoring option"]
[]
[null,"How would you like to estimate the BREEAM score?",null,null,null,null,null,null,null,"Please select:",null,null,null,null,null,null,null,"*"]
[]
[null,"Building details"]
[]
[null,null,null,null,null,null,null,"Building name",null,null,null,null,null,null,null,null,null,"*"]
[]
[null,null,null,null,null,null,null,"Building address",null,null,null,null,null,null,null,null,null,"*"]
[]
[]
[]
[]
[]
[]
[]
[null,null,null,null,null,null,null,"N/A in International Tool",null,null,null,null,null,null,null,null,null,"*"]
[]
[null,null,null,null,null,null,null,"Post code"]
[]
[null,null,null,null,null,null,null,"Country",null,null,null,null,null,null,null,null,null,"*"]
[]
[null,null,null,null,null,null,null,"Building type (main description)",null,null,null,null,null,null,null,null,null,"*"]
[]
[null,null,null,null,null,null,null,"Building type (sub-group)",null,null,null,null,null,null,null,null,null,"*"]
[]
[null,null,null,null,null,null,null,"Building  floor area (GIA) m2",null,null,null,null,null,null,null,null,null,"*"]
[]
[null,null,null,null,null,null,null,"Building  floor area (NIA) m2",null,null,null,null,null,null,null,null,null,"*"]
[]
[null,null,null,null,null,null,null,"BREEAM scheme",null,"New Construction"]
[]
[null,null,null,null,null,null,null,"BREEAM version",null,{"$f":"AD_BREEAM_version","v":"2013 (SD5075)"}]
[]
[null,null,null,null,null,null,null,"BREEAM International New Construction Technical Manual issue number",null,null,null,null,null,null,null,null,null,"*"]
[]
[null,null,null,null,null,null,null,"Project type",null,null,null,null,null,null,null,null,null,"*"]
[]
[null,null,null,null,null,null,null,"Assessment stage",null,{"$f":"ADAS01","v":"Pre-assessment"}]
[]
[null,null,null,null,null,null,null,"Location type"]
[]
[null,null,null,null,null,null,null,"Climatic zone"]
[]
[null,null,null,null,null,null,null,"Building services - heating system type",null,null,null,null,null,null,null,null,null,"*"]
[]
[null,null,null,null,null,null,null,"Building services - cooling system type",null,null,null,null,null,null,null,null,null,"*"]
[]
[null,null,null,null,null,null,null,"Building services - domestic hot water system type"]
[]
[null,null,null,null,null,null,null,"Building service - controls"]
[]
[null,null,null,null,null,null,null,"If applicable, does this industrial building have a heated or cooled operational area?",null,null,null,null,null,null,null,null,null,{"$f":"IF(ADBT0=ADBT2,\"*\",\"\")","v":""}]
[]
[null,null,null,null,null,null,null,"If applicable, will this healthcare building house inpatients? "]
[]
[null,null,null,null,null,null,null,"If  applicable, does this industrial building have an office area?",null,null,null,null,null,null,null,null,null,{"$f":"IF(ADBT0=ADBT2,\"*\",\"\")","v":""}]
[]
[null,null,null,null,null,null,null,"Legislation prohibits the use of ozone depleting substances",null,null,null,null,null,null,null,null,null,"*"]
[]
[null,null,null,null,null,null,null,"Building contains multiple tenants/departments/function areas",null,null,null,null,null,null,null,null,null,"*"]
[]
[null,null,null,null,null,null,null,"Commercial/industrial refrigeration and cold storage systems",null,null,null,null,null,null,null,null,null,"*"]
[]
[null,"What is the building type category (for the purpose of the Transport  section)?",null,null,null,null,null,null,null,null,null,null,null,null,null,null,null,"*"]
[]
[null,"Does the assessed development contain external site access areas (e.g. vehicle access and parking areas)?",null,null,null,null,null,null,null,null,null,null,null,null,null,null,null,"*"]
[]
[null,null,null,null,null,null,null,"Internal or external planting and/or soft landscaping",null,null,null,null,null,null,null,null,null,"*"]
[]
[null,"Are there any risks associated with natural hazards (other than flooding) for the assessed development?",null,null,null,null,null,null,null,null,null,null,null,null,null,null,null,"*"]
[]
[null,null,null,null,null,null,null,"Vehicle Wash System",null,null,null,null,null,null,null,null,null,"*"]
[]
[null,null,null,null,null,null,null,"Building user transportation systems (lifts and/or escalators)",null,null,null,null,null,null,null,null,null,"*"]
[]
[null,null,null,null,null,null,null,"Laboratory function/area and size category",null,null,null,null,null,null,null,null,null,"*"]
[]
[null,null,null,null,null,null,null,"Laboratory containment level",null,null,null,null,null,null,null,null,null,"*"]
[]
[null,null,null,null,null,null,null,"Fume cupboard(s) and/or other containment devices",null,null,null,null,null,null,null,null,null,"*"]
[]
[null,null,null,null,null,null,null,"If applicable, will this healthcare building house inpatients? "]
[]
[null,null,null,null,null,null,null,"If applicable, does this building contain areas requiring SAP assessment?",null,"Option not applicable to building type",null,null,null,null,null,null,null,{"$f":"IF(OR(ADBT0=ADBT8,ADBT0=ADBT9),\"*\",\"\")","v":""}]
[]
[null,null,null,null,null,null,null,"If SAP used, what proportion of the building's total floor area (GIA) does it apply to?",null,"Option not applicable to building type",null,null,null,null,null,null,null,{"$f":"IF(AND(AD_MultiRes_option01=AD_Yes,ADBT0=ADBT8),\"*\",\"\")","v":""}]
[null,"Have the approved section weightings for the country been entered into the \"Summary of Building Performance\" sheet?",null,null,null,null,null,null,null,null,null,null,null,null,null,null,null,"*"]
[]
[null,"Project team details"]
[]
[null,null,null,null,null,null,null,"Developer"]
[]
[null,null,null,null,null,null,null,"Principal contractor"]
[]
[null,null,null,null,null,null,null,"Architect"]
[]
[null,null,null,null,null,null,null,"Project management"]
[]
[null,null,null,null,null,null,null,"Building services"]
[]
[null,null,null,null,null,null,null,"BREEAM Accredited Professional"]
[]
[null,null,null,null,null,null,null,"Other project team member 1"]
[]
[null,null,null,null,null,null,null,"Other project team member 2"]
[]
[null,null,null,null,null,null,null,"Other project team member 3"]
[]
[null,null,null,null,null,null,null,"Other project team member 4"]
[null,"BREEAM assessor declaration of assessment accuracy and quality"]
[]
[null,{"$f":"CONCATENATE(AD_Statement04,AD_assessor,AD_statement05,AD_Assessor_org,AD_statement06)","v":"I, , a qualified BREEAM assessor working on behalf of  confirm that the content of this report is to the best of my knowledge a true and accurate reflection of the performance of the above named building, as measured against the assessment criteria and reporting requirements of the BREEAM Scheme Document (SD5075). Furthermore, I confirm that this assessment and the information on which it is based has been checked and verified in accordance with BRE Global Ltd's UKAS accredited BREEAM operating procedures for BREEAM assessments and assessors, as described in the  technical scheme document (SD5075) and associated BREEAM operational documents."},null,null,null,null,null,null,null,null,null,null,null,null,null,null,null,null,"Note: The tool will populate the statement opposite with the BREEAM assessor and organisation name once it has been entered above in the General Information section."]
[]
[null,null,"BREEAM Assessor Signature",null,null,null,null,null,null,"Date"]
[null,"Which precipitation zone will the building be located in?",null,null,null,null,null,null,null,null,null,null,null,null,null,null,null,"*"]
[]
[]
[]
[]
[]
[null,null,null,null,null,null,null,null,null,null,null,null,null,null,null,null,null,null,null,null,null,null,null,null,null,"Please select:"]
[null,null,null,null,null,null,null,null,null,null,null,null,null,null,null,null,null,null,null,null,null,null,null,null,null,"Simple approach - Manually enter the number of credits achieved for each BREEAM issue (see ‘Simple Scoring Approach’ tab)"]
[null,null,null,null,null,null,null,null,null,null,null,null,null,null,null,null,null,null,null,null,null,null,null,null,null,"Detailed approach - Answer questions for each BREEAM issue to estimate which credits will be achieved (see 'Detailed Scoring Approach' tab)"]
[]
[]
[]
[null,null,null,null,null,null,null,null,null,null,null,null,null,null,null,null,null,null,null,null,null,null,null,null,"Building & Project details data"]
[null,null,null,null,null,null,null,null,null,null,null,null,null,null,null,null,null,null,null,null,null,null,null,null,null,"Note: If you are starting a new pre-assessment please ensure you are using the latest template version of the BREEAM International 2013 Pre-Assessment tool and not a version used for an existing/previous pre-assessment."]
[null,null,null,null,null,null,null,null,null,null,null,null,null,null,null,null,null,null,null,null,null,null,null,null,null,"Note: If laboratory area/function not present, then please select the option \"No Laboratory\" for the \"laboratory size category\" or change the laboratory area/function option to \"Yes\"."]
[null,null,null,null,null,null,null,null,null,null,null,null,null,null,null,null,null,null,null,null,null,null,null,null,null,"The fields below marked with a * are mandatory and must be completed/defined prior to beginning the pre-assessment to ensure an accurate indicative score and BREEAM rating. Note: without this information the pre-assessment tool cannot determine the applicable BREEAM issues and number of credits and data entry will not be possible for the building assessment."]
[null,null,null,null,null,null,null,null,null,null,null,null,null,null,null,null,null,null,null,null,null,null,null,null,null,"Note: Some multi-residential buildings will require areas to be assessed using SAP, where they have self-contained dwellings which are classified under Approved Document L1A Conservation of fuel and power (New dwellings)) of the Building Regulations. "]
[null,null,null,null,null,null,null,null,null,null,null,null,null,null,null,null,null,null,null,null,null,null,null,null,null,"I, "]
[null,null,null,null,null,null,null,null,null,null,null,null,null,null,null,null,null,null,null,null,null,null,null,null,null,", a qualified BREEAM assessor working on behalf of "]
[null,null,null,null,null,null,null,null,null,null,null,null,null,null,null,null,null,null,null,null,null,null,null,null,null," confirm that the content of this report is to the best of my knowledge a true and accurate reflection of the performance of the above named building, as measured against the assessment criteria and reporting requirements of the BREEAM Scheme Document (SD5075). Furthermore, I confirm that this assessment and the information on which it is based has been checked and verified in accordance with BRE Global Ltd's UKAS accredited BREEAM operating procedures for BREEAM assessments and assessors, as described in the  technical scheme document (SD5075) and associated BREEAM operational documents."]
[]
[null,null,null,null,null,null,null,null,null,null,null,null,null,null,null,null,null,null,null,null,null,null,null,null,null,null,null,"Pre-assessment",null,"Office"]
[null,null,null,null,null,null,null,null,null,null,null,null,null,null,null,null,null,null,null,null,null,null,null,null,null,null,null,"Post Construction (Final, as-built)",null,"Industrial"]
[null,null,null,null,null,null,null,null,null,null,null,null,null,null,null,null,null,null,null,null,null,null,null,null,null,null,null,null,null,"Retail"]
[null,null,null,null,null,null,null,null,null,null,null,null,null,null,null,null,null,null,null,null,null,null,null,null,null,null,null,"New Construction (fully fitted)",null,"Residential"]
[null,null,null,null,null,null,null,null,null,null,null,null,null,null,null,null,null,null,null,null,null,null,null,null,null,null,null,"New Construction (shell only) ",null,"Bespoke"]
[null,null,null,null,null,null,null,null,null,null,null,null,null,null,null,null,null,null,null,null,null,null,null,null,null,null,null,"Major Refurbishment (fully fitted)",null,"Bespoke - Residential and Non-Residential"]
[null,null,null,null,null,null,null,null,null,null,null,null,null,null,null,null,null,null,null,null,null,null,null,null,null,"Wet system",null,"Major Refurbishment (shell only)"]
[]
[]
[null,null,null,null,null,null,null,null,null,null,null,null,null,null,null,null,null,null,null,null,null,null,null,null,null,"Air system"]
[null,"Disclaimer\n\n\n",null,null,null,null,null,null,null,null,null,null,null,null,null,null,null,null,null,null,null,null,null,null,null,"Other type of heating system"]
[null,"This Pre-Assessment Estimator is the property of BRE Global Ltd and is made publicly available for information purposes only. Its use for testing, assessment, certification or approval is not permitted. The results presented are indicative only of a building's potential performance which is based on a simplified, informal assessment and unverified commitments. The results do not represent a formal certified BREEAM assessment or rating and must not be communicated as such. BRE Global Ltd accepts no responsibility for any actions taken as a result of information presented or interpreted by the BREEAM Pre-Assessment Estimator. To carry out a formal BREEAM assessment contact a licensed BREEAM Assessor organisation. A list of licensed BREEAM Assessors is available from the Green Book Live website: www.greenbooklive.com",null,null,null,null,null,null,null,null,null,null,null,null,null,null,null,null,null,null,null,null,null,null,null,"None",null,"2013 (SD5075)"]
[]
[null,"Copyright",null,null,null,null,null,null,null,null,null,null,null,null,null,null,null,null,null,null,null,null,null,null,null,"Air-conditioning",null,"SD5075 Issue 0.0"]
[null,"Copyright exists on the BREEAM logo and this may not be used or reproduced for any purpose without the prior written consent of the BRE Global Ltd.\n",null,null,null,null,null,null,null,null,null,null,null,null,null,null,null,null,null,null,null,null,null,null,null,"Comfort cooling"]
[null,null,null,null,null,null,null,null,null,null,null,null,null,null,null,null,null,null,null,null,null,null,null,null,null,"Other type of cooling"]
[null,"The BREEAM name and logo are registered trademarks of the Building Research Establishment Limited.",null,null,null,null,null,null,null,null,null,null,null,null,null,null,null,null,null,null,null,null,null,null,null,"None"]
[null,null,null,null,null,null,null,null,null,null,null,null,null,null,null,null,null,null,null,null,null,null,null,null,null,null,null,null,null,"Industrial - Process / manufacturing unit"]
[null,null,null,null,null,null,null,null,null,null,null,null,null,null,"Version",null,{"$f":"TVC_current_version","v":1},null,null,null,null,null,null,null,null,"Centralised supply and distribution",null,"Yes",null,"Industrial - Vehicle servicing unit"]
[null,null,null,null,null,null,null,null,null,null,null,null,null,null,null,null,null,null,null,null,null,null,null,null,null,"Point of use",null,"Yes",null,"Industrial - Warehouse storage / distribution"]
[null,null,null,null,null,null,null,null,null,null,null,null,null,null,null,null,null,null,null,null,null,null,null,null,null,"Other",null,"Yes",null,"Office - General office building"]
[null,null,null,null,null,null,null,null,null,null,null,null,null,null,null,null,null,null,null,null,null,null,null,null,null,"None",null,"Yes",null,"Office - Office with research and development areas"]
[null,null,null,null,null,null,null,null,null,null,null,null,null,null,null,null,null,null,null,null,null,null,null,null,null,null,null,{"$f":"IF(ADBN=\"\",AD_no,AD_Yes)","v":"No"},null,"Retail - Café"]
[null,null,null,null,null,null,null,null,null,null,null,null,null,null,null,null,null,null,null,null,null,null,null,null,null,"Standard controls (time/temperature)",null,"Yes",null,"Retail - Drinking establishment"]
[null,null,null,null,null,null,null,null,null,null,null,null,null,null,null,null,null,null,null,null,null,null,null,null,null,"Other",null,"Yes",null,"Retail - Food takeaway"]
[null,null,null,null,null,null,null,null,null,null,null,null,null,null,null,null,null,null,null,null,null,null,null,null,null,"None",null,{"$f":"IF(AD_Country=\"\",AD_no,AD_Yes)","v":"No"},null,"Retail - Restaurant"]
[null,null,null,null,null,null,null,null,null,null,null,null,null,null,null,null,null,null,null,null,null,null,null,null,null,null,null,{"$f":"IF(OR(ADBT0=ADBT1,ADBT0=ADBT2,ADBT0=ADBT3,ADBT0=ADBT8,ADBT0=ADBT9,ADBT0=ADBT12,ADBT0=ADBT13),AD_Yes,AD_no)","v":"No"},null,"Retail - Retail park/warehouse"]
[null,null,null,null,null,null,null,null,null,null,null,null,null,null,null,null,null,null,null,null,null,null,null,null,null,"Yes",null,{"$f":"IF(OR(OR(ADBT_sub01=ADBT_sub02,ADBT_sub01=ADBT_sub02,ADBT_sub01=ADBT_sub03,ADBT_sub01=ADBT_sub04,ADBT_sub01=ADBT_sub05,ADBT_sub01=ADBT_sub06,ADBT_sub01=ADBT_sub07,ADBT_sub01=ADBT_sub08,ADBT_sub01=ADBT_sub09,ADBT_sub01=ADBT_sub10,ADBT_sub01=ADBT_sub11,ADBT_sub01=ADBT_sub12,ADBT_sub01=ADBT_sub13,ADBT_sub01=ADBT_sub14,ADBT_sub01=ADBT_sub15,ADBT_sub01=ADBT_sub16,ADBT_sub01=ADBT_sub17,,ADBT_sub01=ADBT_sub20,)),AIS_Yes,AIS_No)","v":"No"},null,"Retail - Service provider 'over the counter'"]
[null,null,null,null,null,null,null,null,null,null,null,null,null,null,null,null,null,null,null,null,null,null,null,null,null,"No",null,"Yes",null,"Retail - Shop"]
[null,null,null,null,null,null,null,null,null,null,null,null,null,null,null,null,null,null,null,null,null,null,null,null,null,"Option not applicable to building type",null,"Yes",null,"Retail - Shopping centre"]
[null,null,null,null,null,null,null,null,null,null,null,null,null,null,null,null,null,null,null,null,null,null,null,null,null,null,null,"Yes",null,"Retail - Showroom"]
[null,null,null,null,null,null,null,null,null,null,null,null,null,null,null,null,null,null,null,null,null,null,null,null,null,"Laboratory present: <10% of building's Gross Internal Floor Area",null,{"$f":"IF(OR(ADPT=ADPT01,ADPT=ADPT02,ADPT=ADPT03,ADPT=ADPT04),AD_Yes,AD_no)","v":"No"},null,"Residential - Individual Dwellings"]
[null,null,null,null,null,null,null,null,null,null,null,null,null,null,null,null,null,null,null,null,null,null,null,null,null,"Laboratory present: ≥10% - <25% of building's Gross Internal Floor Area",null,"Yes",null,"Residential - Apartment Blocks"]
[null,null,null,null,null,null,null,null,null,null,null,null,null,null,null,null,null,null,null,null,null,null,null,null,null,"Laboratory present: ≥25% of building's Gross Internal Floor Area",null,"Yes",null,"Bespoke"]
[null,null,null,null,null,null,null,null,null,null,null,null,null,null,null,null,null,null,null,null,null,null,null,null,null,"No laboratory",null,"Yes"]
[null,null,null,null,null,null,null,null,null,null,null,null,null,null,null,null,null,null,null,null,null,null,null,null,null,null,null,{"$f":"IF(OR(AD_Ozoneleg=AD_Yes,AD_Ozoneleg=AD_no),AD_Yes,AD_no)","v":"No"}]
[null,null,null,null,null,null,null,null,null,null,null,null,null,null,null,null,null,null,null,null,null,null,null,null,null,"Cat Level 1 only",null,{"$f":"IF(OR(AD_Multitenant=AD_Yes,AD_Multitenant=AD_no),AD_Yes,AD_no)","v":"No"}]
[null,null,null,null,null,null,null,null,null,null,null,null,null,null,null,null,null,null,null,null,null,null,null,null,null,"Cat Level 2",null,{"$f":"IF(OR(AD_refrig=AD_Yes,AD_refrig=AD_no),AD_Yes,AD_no)","v":"No"}]
[null,null,null,null,null,null,null,null,null,null,null,null,null,null,null,null,null,null,null,null,null,null,null,null,null,"Cat Level 3",null,{"$f":"IF(OR(AD_Landscape=AD_Yes,AD_Landscape=AD_no),AD_Yes,AD_no)","v":"No"}]
[null,null,null,null,null,null,null,null,null,null,null,null,null,null,null,null,null,null,null,null,null,null,null,null,null,"No laboratory",null,{"$f":"IF(OR(AD_Trans=AD_Yes,AD_Trans=AD_no),AD_Yes,AD_no)","v":"No"}]
[null,null,null,null,null,null,null,null,null,null,null,null,null,null,null,null,null,null,null,null,null,null,null,null,null,null,null,{"$f":"IF(OR(AD_Labsize=AD_labsize04,AD_Labsize=AD_Labsize01,AD_Labsize=AD_Labsize02,AD_Labsize=AD_Labsize03),AD_Yes,AD_no)","v":"No"}]
[null,null,null,null,null,null,null,null,null,null,null,null,null,null,null,null,null,null,null,null,null,null,null,null,null,"New Construction",null,{"$f":"IF(OR(AD_catlevel=AD_catlevel01,AD_catlevel=AD_catlevel02,AD_catlevel=AD_catlevel03,AD_catlevel=AD_nolab),AD_Yes,AD_no)","v":"No"}]
[null,null,null,null,null,null,null,null,null,null,null,null,null,null,null,null,null,null,null,null,null,null,null,null,null,null,null,{"$f":"IF(OR(ADFume_option01=AD_Yes,ADFume_option01=AD_no),AD_Yes,AD_no)","v":"No"}]
[null,null,null,null,null,null,null,null,null,null,null,null,null,null,null,null,null,null,null,null,null,null,null,null,null,"Large city >1m population",null,{"$f":"IF(OR(AD_Vehiclewash=AD_Yes,AD_Vehiclewash=AD_no),AD_Yes,AD_no)","v":"No"}]
[null,null,null,null,null,null,null,null,null,null,null,null,null,null,null,null,null,null,null,null,null,null,null,null,null,"Metropolitan built-up area (>250,000 population)",null,"Yes"]
[null,null,null,null,null,null,null,null,null,null,null,null,null,null,null,null,null,null,null,null,null,null,null,null,null,"Large urban (>250,000 population)",null,{"$f":"IF(ADBT0=ADBT2,IF(OR(ADIND_option01=AD_Yes,ADIND_option01=AD_no,ADIND_option01=AD_option_na),AD_Yes,AD_no),AD_Yes)","v":"Yes"}]
[null,null,null,null,null,null,null,null,null,null,null,null,null,null,null,null,null,null,null,null,null,null,null,null,null,"Medium urban (>25,000 population)",null,{"$f":"IF(ADBT0=ADBT2,IF(OR(ADIND_option02=AD_Yes,ADIND_option02=AD_no,ADIND_option02=AD_option_na),AD_Yes,AD_no),AD_Yes)","v":"Yes"}]
[null,null,null,null,null,null,null,null,null,null,null,null,null,null,null,null,null,null,null,null,null,null,null,null,null,"Small/medium urban (>10,000 population)",null,{"$f":"IF(AD_Weightings=\"\",AIS_No,AIS_Yes)","v":"No"},null,"Yes"]
[null,null,null,null,null,null,null,null,null,null,null,null,null,null,null,null,null,null,null,null,null,null,null,null,null,"Small urban (>3000 population)",null,{"$f":"IF(OR(Score_option=PSc0,Score_option=\"\"),\"No\",\"Yes\")","v":"No"},null,"Default weightings used for pre-assessment"]
[null,null,null,null,null,null,null,null,null,null,null,null,null,null,null,null,null,null,null,null,null,null,null,null,null,"Rural (<3000 population)",null,{"$f":"IF(OR(AD_p_zone=AD_p_zone0,AD_p_zone=\"\"),\"No\",\"Yes\")","v":"No"}]
[null,null,null,null,null,null,null,null,null,null,null,null,null,null,null,null,null,null,null,null,null,null,null,null,null,null,null,{"$f":"IF(OR(AD_tra01type=\"\",AD_tra01type=\"Please select:\"),AIS_No,AIS_Yes)","v":"No"}]
[null,null,null,null,null,null,null,null,null,null,null,null,null,null,null,null,null,null,null,null,null,null,null,null,null,null,null,{"$f":"IF(S2=\"remove mandatory filter\",0,COUNTIF(AD_mandatory_fields,AD_no))","v":18}]
[null,null,null,null,null,null,null,null,null,null,null,null,null,null,null,null,null,null,null,null,null,null,null,null,null,{"$f":"IF(ADBT0=ADBT2,AD_Yes,AD_option_na)","v":"Option not applicable to building type"}]
[null,null,null,null,null,null,null,null,null,null,null,null,null,null,null,null,null,null,null,null,null,null,null,null,null,{"$f":"IF(ADBT0=ADBT2,AD_no,\"\")","v":""},null,{"$f":"IF(AD_MultiRes_option01=AD_Yes,0%,\"Option not applicable to building type\")","v":"Option not applicable to building type"},null,"Please select:"]
[null,null,null,null,null,null,null,null,null,null,null,null,null,null,null,null,null,null,null,null,null,null,null,null,null,null,null,{"$f":"IF(AD_MultiRes_option01=AD_Yes,AB205+1%,\"\")","v":""},null,"Precipitation zone 1"]
[null,null,null,null,null,null,null,null,null,null,null,null,null,null,null,null,null,null,null,null,null,null,null,null,null,{"$f":"IF(ADBT0=ADBT5,AD_Yes,AD_option_na)","v":{"$error":"#NAME?"}},null,{"$f":"IF(AD_MultiRes_option01=AD_Yes,#REF!+1%,\"\")","v":""},null,"Precipitation zone 2"]
[null,null,null,null,null,null,null,null,null,null,null,null,null,null,null,null,null,null,null,null,null,null,null,null,null,{"$f":"IF(ADBT0=ADBT5,AD_no,\"\")","v":{"$error":"#NAME?"}},null,{"$f":"IF(AD_MultiRes_option01=AD_Yes,AB207+1%,\"\")","v":""},null,"Precipitation zone 3"]
[null,null,null,null,null,null,null,null,null,null,null,null,null,null,null,null,null,null,null,null,null,null,null,null,null,null,null,""]
[null,null,null,null,null,null,null,null,null,null,null,null,null,null,null,null,null,null,null,null,null,null,null,null,null,{"$f":"IF(OR(ADBT0=ADBT8,ADBT0=ADBT9),AD_Yes,AD_option_na)","v":"Option not applicable to building type"},null,""]
[null,null,null,null,null,null,null,null,null,null,null,null,null,null,null,null,null,null,null,null,null,null,null,null,null,{"$f":"IF(OR(ADBT0=ADBT8,ADBT0=ADBT9),AD_no,\"\")","v":""},null,""]
[null,null,null,null,null,null,null,null,null,null,null,null,null,null,null,null,null,null,null,null,null,null,null,null,null,null,null,""]
[null,null,null,null,null,null,null,null,null,null,null,null,null,null,null,null,null,null,null,null,null,null,null,null,null,"Project type:",null,""]
[null,null,null,null,null,null,null,null,null,null,null,null,null,null,null,null,null,null,null,null,null,null,null,null,null,"Standard assessment",null,""]
[null,null,null,null,null,null,null,null,null,null,null,null,null,null,null,null,null,null,null,null,null,null,null,null,null,"Bespoke",null,""]
[null,null,null,null,null,null,null,null,null,null,null,null,null,null,null,null,null,null,null,null,null,null,null,null,null,"Standard assessment",null,""]
[null,null,null,null,null,null,null,null,null,null,null,null,null,null,null,null,null,null,null,null,null,null,null,null,null,null,null,""]
[null,null,null,null,null,null,null,null,null,null,null,null,null,null,null,null,null,null,null,null,null,null,null,null,null,null,null,""]
[null,null,null,null,null,null,null,null,null,null,null,null,null,null,null,null,null,null,null,null,null,null,null,null,null,"Criteria",null,""]
[null,null,null,null,null,null,null,null,null,null,null,null,null,null,null,null,null,null,null,null,null,null,null,null,null,"Amended Criteria",null,""]
[null,null,null,null,null,null,null,null,null,null,null,null,null,null,null,null,null,null,null,null,null,null,null,null,null,null,null,""]
[null,null,null,null,null,null,null,null,null,null,null,null,null,null,null,null,null,null,null,null,null,null,null,null,null,null,null,""]
[null,null,null,null,null,null,null,null,null,null,null,null,null,null,null,null,null,null,null,null,null,null,null,null,null,"A. Equatorial",null,""]
[null,null,null,null,null,null,null,null,null,null,null,null,null,null,null,null,null,null,null,null,null,null,null,null,null,"B. Arid",null,""]
[null,null,null,null,null,null,null,null,null,null,null,null,null,null,null,null,null,null,null,null,null,null,null,null,null,"C. Warm Temperate",null,""]
[null,null,null,null,null,null,null,null,null,null,null,null,null,null,null,null,null,null,null,null,null,null,null,null,null,"D. Snow",null,""]
[null,null,null,null,null,null,null,null,null,null,null,null,null,null,null,null,null,null,null,null,null,null,null,null,null,"E. Polar",null,""]
[null,null,null,null,null,null,null,null,null,null,null,null,null,null,null,null,null,null,null,null,null,null,null,null,null,null,null,""]
[null,null,null,null,null,null,null,null,null,null,null,null,null,null,null,null,null,null,null,null,null,null,null,null,null,null,null,""]
[null,null,null,null,null,null,null,null,null,null,null,null,null,null,null,null,null,null,null,null,null,null,null,null,null,"Afghanistan",null,""]
[null,null,null,null,null,null,null,null,null,null,null,null,null,null,null,null,null,null,null,null,null,null,null,null,null,"Albania",null,""]
[null,null,null,null,null,null,null,null,null,null,null,null,null,null,null,null,null,null,null,null,null,null,null,null,null,"Algeria",null,""]
[null,null,null,null,null,null,null,null,null,null,null,null,null,null,null,null,null,null,null,null,null,null,null,null,null,"Angola",null,""]
[null,null,null,null,null,null,null,null,null,null,null,null,null,null,null,null,null,null,null,null,null,null,null,null,null,"Antigua & Barbuda",null,""]
[null,null,null,null,null,null,null,null,null,null,null,null,null,null,null,null,null,null,null,null,null,null,null,null,null,"Argentina",null,""]
[null,null,null,null,null,null,null,null,null,null,null,null,null,null,null,null,null,null,null,null,null,null,null,null,null,"Armenia",null,""]
[null,null,null,null,null,null,null,null,null,null,null,null,null,null,null,null,null,null,null,null,null,null,null,null,null,"Australia",null,{"$f":"IF(AD_MultiRes_option01=AD_Yes,AB236+1%,\"\")","v":""}]
[null,null,null,null,null,null,null,null,null,null,null,null,null,null,null,null,null,null,null,null,null,null,null,null,null,"Austria",null,""]
[null,null,null,null,null,null,null,null,null,null,null,null,null,null,null,null,null,null,null,null,null,null,null,null,null,"Azerbaijan",null,""]
[null,null,null,null,null,null,null,null,null,null,null,null,null,null,null,null,null,null,null,null,null,null,null,null,null,"Bahamas",null,""]
[null,null,null,null,null,null,null,null,null,null,null,null,null,null,null,null,null,null,null,null,null,null,null,null,null,"Bahrain",null,""]
[null,null,null,null,null,null,null,null,null,null,null,null,null,null,null,null,null,null,null,null,null,null,null,null,null,"Bangladesh",null,""]
[null,null,null,null,null,null,null,null,null,null,null,null,null,null,null,null,null,null,null,null,null,null,null,null,null,"Barbados",null,""]
[null,null,null,null,null,null,null,null,null,null,null,null,null,null,null,null,null,null,null,null,null,null,null,null,null,"Belarus",null,""]
[null,null,null,null,null,null,null,null,null,null,null,null,null,null,null,null,null,null,null,null,null,null,null,null,null,"Belgium",null,""]
[null,null,null,null,null,null,null,null,null,null,null,null,null,null,null,null,null,null,null,null,null,null,null,null,null,"Belize",null,""]
[null,null,null,null,null,null,null,null,null,null,null,null,null,null,null,null,null,null,null,null,null,null,null,null,null,"Benin",null,""]
[null,null,null,null,null,null,null,null,null,null,null,null,null,null,null,null,null,null,null,null,null,null,null,null,null,"Bhutan",null,""]
[null,null,null,null,null,null,null,null,null,null,null,null,null,null,null,null,null,null,null,null,null,null,null,null,null,"Bolivia",null,""]
[null,null,null,null,null,null,null,null,null,null,null,null,null,null,null,null,null,null,null,null,null,null,null,null,null,"Bosnia & Herzegovina",null,""]
[null,null,null,null,null,null,null,null,null,null,null,null,null,null,null,null,null,null,null,null,null,null,null,null,null,"Botswana",null,""]
[null,null,null,null,null,null,null,null,null,null,null,null,null,null,null,null,null,null,null,null,null,null,null,null,null,"Brazil",null,""]
[null,null,null,null,null,null,null,null,null,null,null,null,null,null,null,null,null,null,null,null,null,null,null,null,null,"Brunei",null,""]
[null,null,null,null,null,null,null,null,null,null,null,null,null,null,null,null,null,null,null,null,null,null,null,null,null,"Bulgaria",null,""]
[null,null,null,null,null,null,null,null,null,null,null,null,null,null,null,null,null,null,null,null,null,null,null,null,null,"Burkina Faso",null,""]
[null,null,null,null,null,null,null,null,null,null,null,null,null,null,null,null,null,null,null,null,null,null,null,null,null,"Burundi",null,""]
[null,null,null,null,null,null,null,null,null,null,null,null,null,null,null,null,null,null,null,null,null,null,null,null,null,"Cambodia",null,""]
[null,null,null,null,null,null,null,null,null,null,null,null,null,null,null,null,null,null,null,null,null,null,null,null,null,"Cameroon",null,""]
[null,null,null,null,null,null,null,null,null,null,null,null,null,null,null,null,null,null,null,null,null,null,null,null,null,"Canada",null,""]
[null,null,null,null,null,null,null,null,null,null,null,null,null,null,null,null,null,null,null,null,null,null,null,null,null,"Cape Verde",null,""]
[null,null,null,null,null,null,null,null,null,null,null,null,null,null,null,null,null,null,null,null,null,null,null,null,null,"Central African Republic",null,""]
[null,null,null,null,null,null,null,null,null,null,null,null,null,null,null,null,null,null,null,null,null,null,null,null,null,"Chad",null,""]
[null,null,null,null,null,null,null,null,null,null,null,null,null,null,null,null,null,null,null,null,null,null,null,null,null,"Chile",null,""]
[null,null,null,null,null,null,null,null,null,null,null,null,null,null,null,null,null,null,null,null,null,null,null,null,null,"China",null,""]
[null,null,null,null,null,null,null,null,null,null,null,null,null,null,null,null,null,null,null,null,null,null,null,null,null,"Colombia",null,""]
[null,null,null,null,null,null,null,null,null,null,null,null,null,null,null,null,null,null,null,null,null,null,null,null,null,"Comoros",null,""]
[null,null,null,null,null,null,null,null,null,null,null,null,null,null,null,null,null,null,null,null,null,null,null,null,null,"Congo",null,""]
[null,null,null,null,null,null,null,null,null,null,null,null,null,null,null,null,null,null,null,null,null,null,null,null,null,"Congo, Dem. Republic",null,""]
[null,null,null,null,null,null,null,null,null,null,null,null,null,null,null,null,null,null,null,null,null,null,null,null,null,"Cook Islands",null,{"$f":"IF(AD_MultiRes_option01=AD_Yes,AB268+1%,\"\")","v":""}]
[null,null,null,null,null,null,null,null,null,null,null,null,null,null,null,null,null,null,null,null,null,null,null,null,null,"Costa Rica",null,""]
[null,null,null,null,null,null,null,null,null,null,null,null,null,null,null,null,null,null,null,null,null,null,null,null,null,"Côte d'Ivoire",null,""]
[null,null,null,null,null,null,null,null,null,null,null,null,null,null,null,null,null,null,null,null,null,null,null,null,null,"Croatia",null,""]
[null,null,null,null,null,null,null,null,null,null,null,null,null,null,null,null,null,null,null,null,null,null,null,null,null,"Cuba",null,""]
[null,null,null,null,null,null,null,null,null,null,null,null,null,null,null,null,null,null,null,null,null,null,null,null,null,"Cyprus",null,""]
[null,null,null,null,null,null,null,null,null,null,null,null,null,null,null,null,null,null,null,null,null,null,null,null,null,"Czech Republic",null,""]
[null,null,null,null,null,null,null,null,null,null,null,null,null,null,null,null,null,null,null,null,null,null,null,null,null,"Denmark",null,""]
[null,null,null,null,null,null,null,null,null,null,null,null,null,null,null,null,null,null,null,null,null,null,null,null,null,"Djibouti",null,""]
[null,null,null,null,null,null,null,null,null,null,null,null,null,null,null,null,null,null,null,null,null,null,null,null,null,"Dominica",null,""]
[null,null,null,null,null,null,null,null,null,null,null,null,null,null,null,null,null,null,null,null,null,null,null,null,null,"Dominican Republic",null,""]
[null,null,null,null,null,null,null,null,null,null,null,null,null,null,null,null,null,null,null,null,null,null,null,null,null,"Ecuador",null,""]
[null,null,null,null,null,null,null,null,null,null,null,null,null,null,null,null,null,null,null,null,null,null,null,null,null,"Egypt",null,""]
[null,null,null,null,null,null,null,null,null,null,null,null,null,null,null,null,null,null,null,null,null,null,null,null,null,"El Salvador",null,""]
[null,null,null,null,null,null,null,null,null,null,null,null,null,null,null,null,null,null,null,null,null,null,null,null,null,"Equatorial Guinea",null,""]
[null,null,null,null,null,null,null,null,null,null,null,null,null,null,null,null,null,null,null,null,null,null,null,null,null,"Eritrea",null,""]
[null,null,null,null,null,null,null,null,null,null,null,null,null,null,null,null,null,null,null,null,null,null,null,null,null,"Estonia",null,""]
[null,null,null,null,null,null,null,null,null,null,null,null,null,null,null,null,null,null,null,null,null,null,null,null,null,"Ethiopia",null,""]
[null,null,null,null,null,null,null,null,null,null,null,null,null,null,null,null,null,null,null,null,null,null,null,null,null,"Fiji",null,""]
[null,null,null,null,null,null,null,null,null,null,null,null,null,null,null,null,null,null,null,null,null,null,null,null,null,"Finland",null,""]
[null,null,null,null,null,null,null,null,null,null,null,null,null,null,null,null,null,null,null,null,null,null,null,null,null,"France",null,""]
[null,null,null,null,null,null,null,null,null,null,null,null,null,null,null,null,null,null,null,null,null,null,null,null,null,"Gabon",null,""]
[null,null,null,null,null,null,null,null,null,null,null,null,null,null,null,null,null,null,null,null,null,null,null,null,null,"Gambia",null,""]
[null,null,null,null,null,null,null,null,null,null,null,null,null,null,null,null,null,null,null,null,null,null,null,null,null,"Georgia",null,""]
[null,null,null,null,null,null,null,null,null,null,null,null,null,null,null,null,null,null,null,null,null,null,null,null,null,"Germany",null,""]
[null,null,null,null,null,null,null,null,null,null,null,null,null,null,null,null,null,null,null,null,null,null,null,null,null,"Ghana",null,""]
[null,null,null,null,null,null,null,null,null,null,null,null,null,null,null,null,null,null,null,null,null,null,null,null,null,"Greece",null,""]
[null,null,null,null,null,null,null,null,null,null,null,null,null,null,null,null,null,null,null,null,null,null,null,null,null,"Grenada",null,""]
[null,null,null,null,null,null,null,null,null,null,null,null,null,null,null,null,null,null,null,null,null,null,null,null,null,"Guatemala",null,""]
[null,null,null,null,null,null,null,null,null,null,null,null,null,null,null,null,null,null,null,null,null,null,null,null,null,"Guinea",null,""]
[null,null,null,null,null,null,null,null,null,null,null,null,null,null,null,null,null,null,null,null,null,null,null,null,null,"Guinea-Bissau",null,""]
[null,null,null,null,null,null,null,null,null,null,null,null,null,null,null,null,null,null,null,null,null,null,null,null,null,"Guyana",null,""]
[null,null,null,null,null,null,null,null,null,null,null,null,null,null,null,null,null,null,null,null,null,null,null,null,null,"Haiti",null,""]
[null,null,null,null,null,null,null,null,null,null,null,null,null,null,null,null,null,null,null,null,null,null,null,null,null,"Honduras",null,""]
[null,null,null,null,null,null,null,null,null,null,null,null,null,null,null,null,null,null,null,null,null,null,null,null,null,"Hungary",null,""]
[null,null,null,null,null,null,null,null,null,null,null,null,null,null,null,null,null,null,null,null,null,null,null,null,null,"Iceland",null,""]
[null,null,null,null,null,null,null,null,null,null,null,null,null,null,null,null,null,null,null,null,null,null,null,null,null,"India"]
[null,null,null,null,null,null,null,null,null,null,null,null,null,null,null,null,null,null,null,null,null,null,null,null,null,"Indonesia"]
[null,null,null,null,null,null,null,null,null,null,null,null,null,null,null,null,null,null,null,null,null,null,null,null,null,"Iran"]
[null,null,null,null,null,null,null,null,null,null,null,null,null,null,null,null,null,null,null,null,null,null,null,null,null,"Iraq"]
[null,null,null,null,null,null,null,null,null,null,null,null,null,null,null,null,null,null,null,null,null,null,null,null,null,"Ireland"]
[null,null,null,null,null,null,null,null,null,null,null,null,null,null,null,null,null,null,null,null,null,null,null,null,null,"Israel"]
[null,null,null,null,null,null,null,null,null,null,null,null,null,null,null,null,null,null,null,null,null,null,null,null,null,"Italy"]
[null,null,null,null,null,null,null,null,null,null,null,null,null,null,null,null,null,null,null,null,null,null,null,null,null,"Jamaica"]
[null,null,null,null,null,null,null,null,null,null,null,null,null,null,null,null,null,null,null,null,null,null,null,null,null,"Japan"]
[null,null,null,null,null,null,null,null,null,null,null,null,null,null,null,null,null,null,null,null,null,null,null,null,null,"Jordan"]
[null,null,null,null,null,null,null,null,null,null,null,null,null,null,null,null,null,null,null,null,null,null,null,null,null,"Kazakhstan"]
[null,null,null,null,null,null,null,null,null,null,null,null,null,null,null,null,null,null,null,null,null,null,null,null,null,"Kenya"]
[null,null,null,null,null,null,null,null,null,null,null,null,null,null,null,null,null,null,null,null,null,null,null,null,null,"Kiribati"]
[null,null,null,null,null,null,null,null,null,null,null,null,null,null,null,null,null,null,null,null,null,null,null,null,null,"Korea (North)"]
[null,null,null,null,null,null,null,null,null,null,null,null,null,null,null,null,null,null,null,null,null,null,null,null,null,"Korea (South)"]
[null,null,null,null,null,null,null,null,null,null,null,null,null,null,null,null,null,null,null,null,null,null,null,null,null,"Kuwait"]
[null,null,null,null,null,null,null,null,null,null,null,null,null,null,null,null,null,null,null,null,null,null,null,null,null,"Kyrgyzstan"]
[null,null,null,null,null,null,null,null,null,null,null,null,null,null,null,null,null,null,null,null,null,null,null,null,null,"Laos"]
[null,null,null,null,null,null,null,null,null,null,null,null,null,null,null,null,null,null,null,null,null,null,null,null,null,"Latvia"]
[null,null,null,null,null,null,null,null,null,null,null,null,null,null,null,null,null,null,null,null,null,null,null,null,null,"Lebanon"]
[null,null,null,null,null,null,null,null,null,null,null,null,null,null,null,null,null,null,null,null,null,null,null,null,null,"Lesotho"]
[null,null,null,null,null,null,null,null,null,null,null,null,null,null,null,null,null,null,null,null,null,null,null,null,null,"Liberia"]
[null,null,null,null,null,null,null,null,null,null,null,null,null,null,null,null,null,null,null,null,null,null,null,null,null,"Libya"]
[null,null,null,null,null,null,null,null,null,null,null,null,null,null,null,null,null,null,null,null,null,null,null,null,null,"Lithuania"]
[null,null,null,null,null,null,null,null,null,null,null,null,null,null,null,null,null,null,null,null,null,null,null,null,null,"Luxembourg"]
[null,null,null,null,null,null,null,null,null,null,null,null,null,null,null,null,null,null,null,null,null,null,null,null,null,"Macedonia, FYR"]
[null,null,null,null,null,null,null,null,null,null,null,null,null,null,null,null,null,null,null,null,null,null,null,null,null,"Madagascar"]
[null,null,null,null,null,null,null,null,null,null,null,null,null,null,null,null,null,null,null,null,null,null,null,null,null,"Malawi"]
[null,null,null,null,null,null,null,null,null,null,null,null,null,null,null,null,null,null,null,null,null,null,null,null,null,"Malaysia"]
[null,null,null,null,null,null,null,null,null,null,null,null,null,null,null,null,null,null,null,null,null,null,null,null,null,"Maldives"]
[null,null,null,null,null,null,null,null,null,null,null,null,null,null,null,null,null,null,null,null,null,null,null,null,null,"Mali"]
[null,null,null,null,null,null,null,null,null,null,null,null,null,null,null,null,null,null,null,null,null,null,null,null,null,"Malta"]
[null,null,null,null,null,null,null,null,null,null,null,null,null,null,null,null,null,null,null,null,null,null,null,null,null,"Mauritania"]
[null,null,null,null,null,null,null,null,null,null,null,null,null,null,null,null,null,null,null,null,null,null,null,null,null,"Mauritius"]
[null,null,null,null,null,null,null,null,null,null,null,null,null,null,null,null,null,null,null,null,null,null,null,null,null,"Mexico"]
[null,null,null,null,null,null,null,null,null,null,null,null,null,null,null,null,null,null,null,null,null,null,null,null,null,"Moldova"]
[null,null,null,null,null,null,null,null,null,null,null,null,null,null,null,null,null,null,null,null,null,null,null,null,null,"Mongolia"]
[null,null,null,null,null,null,null,null,null,null,null,null,null,null,null,null,null,null,null,null,null,null,null,null,null,"Morocco"]
[null,null,null,null,null,null,null,null,null,null,null,null,null,null,null,null,null,null,null,null,null,null,null,null,null,"Mozambique"]
[null,null,null,null,null,null,null,null,null,null,null,null,null,null,null,null,null,null,null,null,null,null,null,null,null,"Myanmar"]
[null,null,null,null,null,null,null,null,null,null,null,null,null,null,null,null,null,null,null,null,null,null,null,null,null,"Namibia"]
[null,null,null,null,null,null,null,null,null,null,null,null,null,null,null,null,null,null,null,null,null,null,null,null,null,"Nauru"]
[null,null,null,null,null,null,null,null,null,null,null,null,null,null,null,null,null,null,null,null,null,null,null,null,null,"Nepal"]
[null,null,null,null,null,null,null,null,null,null,null,null,null,null,null,null,null,null,null,null,null,null,null,null,null,"Netherlands"]
[null,null,null,null,null,null,null,null,null,null,null,null,null,null,null,null,null,null,null,null,null,null,null,null,null,"New Zealand"]
[null,null,null,null,null,null,null,null,null,null,null,null,null,null,null,null,null,null,null,null,null,null,null,null,null,"Nicaragua"]
[null,null,null,null,null,null,null,null,null,null,null,null,null,null,null,null,null,null,null,null,null,null,null,null,null,"Niger"]
[null,null,null,null,null,null,null,null,null,null,null,null,null,null,null,null,null,null,null,null,null,null,null,null,null,"Nigeria"]
[null,null,null,null,null,null,null,null,null,null,null,null,null,null,null,null,null,null,null,null,null,null,null,null,null,"Niue"]
[null,null,null,null,null,null,null,null,null,null,null,null,null,null,null,null,null,null,null,null,null,null,null,null,null,"Norway"]
[null,null,null,null,null,null,null,null,null,null,null,null,null,null,null,null,null,null,null,null,null,null,null,null,null,"Oman"]
[null,null,null,null,null,null,null,null,null,null,null,null,null,null,null,null,null,null,null,null,null,null,null,null,null,"Pakistan"]
[null,null,null,null,null,null,null,null,null,null,null,null,null,null,null,null,null,null,null,null,null,null,null,null,null,"Palau"]
[null,null,null,null,null,null,null,null,null,null,null,null,null,null,null,null,null,null,null,null,null,null,null,null,null,"Panama"]
[null,null,null,null,null,null,null,null,null,null,null,null,null,null,null,null,null,null,null,null,null,null,null,null,null,"Papua New Guinea"]
[null,null,null,null,null,null,null,null,null,null,null,null,null,null,null,null,null,null,null,null,null,null,null,null,null,"Paraguay"]
[null,null,null,null,null,null,null,null,null,null,null,null,null,null,null,null,null,null,null,null,null,null,null,null,null,"Peru"]
[null,null,null,null,null,null,null,null,null,null,null,null,null,null,null,null,null,null,null,null,null,null,null,null,null,"Philippines"]
[null,null,null,null,null,null,null,null,null,null,null,null,null,null,null,null,null,null,null,null,null,null,null,null,null,"Poland"]
[null,null,null,null,null,null,null,null,null,null,null,null,null,null,null,null,null,null,null,null,null,null,null,null,null,"Portugal"]
[null,null,null,null,null,null,null,null,null,null,null,null,null,null,null,null,null,null,null,null,null,null,null,null,null,"Qatar"]
[null,null,null,null,null,null,null,null,null,null,null,null,null,null,null,null,null,null,null,null,null,null,null,null,null,"Romania"]
[null,null,null,null,null,null,null,null,null,null,null,null,null,null,null,null,null,null,null,null,null,null,null,null,null,"Russia"]
[null,null,null,null,null,null,null,null,null,null,null,null,null,null,null,null,null,null,null,null,null,null,null,null,null,"Rwanda"]
[null,null,null,null,null,null,null,null,null,null,null,null,null,null,null,null,null,null,null,null,null,null,null,null,null,"Saint Kitts &  Nevis"]
[null,null,null,null,null,null,null,null,null,null,null,null,null,null,null,null,null,null,null,null,null,null,null,null,null,"Saint Lucia"]
[null,null,null,null,null,null,null,null,null,null,null,null,null,null,null,null,null,null,null,null,null,null,null,null,null,"Saint Vincent &  Grenadines"]
[null,null,null,null,null,null,null,null,null,null,null,null,null,null,null,null,null,null,null,null,null,null,null,null,null,"Samoa"]
[null,null,null,null,null,null,null,null,null,null,null,null,null,null,null,null,null,null,null,null,null,null,null,null,null,"Sao Tome &  Principe"]
[null,null,null,null,null,null,null,null,null,null,null,null,null,null,null,null,null,null,null,null,null,null,null,null,null,"Saudi Arabia"]
[null,null,null,null,null,null,null,null,null,null,null,null,null,null,null,null,null,null,null,null,null,null,null,null,null,"Senegal"]
[null,null,null,null,null,null,null,null,null,null,null,null,null,null,null,null,null,null,null,null,null,null,null,null,null,"Serbia & Montenegro"]
[null,null,null,null,null,null,null,null,null,null,null,null,null,null,null,null,null,null,null,null,null,null,null,null,null,"Seychelles"]
[null,null,null,null,null,null,null,null,null,null,null,null,null,null,null,null,null,null,null,null,null,null,null,null,null,"Sierra Leone"]
[null,null,null,null,null,null,null,null,null,null,null,null,null,null,null,null,null,null,null,null,null,null,null,null,null,"Singapore"]
[null,null,null,null,null,null,null,null,null,null,null,null,null,null,null,null,null,null,null,null,null,null,null,null,null,"Slovakia"]
[null,null,null,null,null,null,null,null,null,null,null,null,null,null,null,null,null,null,null,null,null,null,null,null,null,"Slovenia"]
[null,null,null,null,null,null,null,null,null,null,null,null,null,null,null,null,null,null,null,null,null,null,null,null,null,"Solomon Islands"]
[null,null,null,null,null,null,null,null,null,null,null,null,null,null,null,null,null,null,null,null,null,null,null,null,null,"South Africa"]
[null,null,null,null,null,null,null,null,null,null,null,null,null,null,null,null,null,null,null,null,null,null,null,null,null,"Spain"]
[null,null,null,null,null,null,null,null,null,null,null,null,null,null,null,null,null,null,null,null,null,null,null,null,null,"Sri Lanka"]
[null,null,null,null,null,null,null,null,null,null,null,null,null,null,null,null,null,null,null,null,null,null,null,null,null,"Sudan"]
[null,null,null,null,null,null,null,null,null,null,null,null,null,null,null,null,null,null,null,null,null,null,null,null,null,"Suriname"]
[null,null,null,null,null,null,null,null,null,null,null,null,null,null,null,null,null,null,null,null,null,null,null,null,null,"Swaziland"]
[null,null,null,null,null,null,null,null,null,null,null,null,null,null,null,null,null,null,null,null,null,null,null,null,null,"Sweden"]
[null,null,null,null,null,null,null,null,null,null,null,null,null,null,null,null,null,null,null,null,null,null,null,null,null,"Switzerland"]
[null,null,null,null,null,null,null,null,null,null,null,null,null,null,null,null,null,null,null,null,null,null,null,null,null,"Syria"]
[null,null,null,null,null,null,null,null,null,null,null,null,null,null,null,null,null,null,null,null,null,null,null,null,null,"Taiwan"]
[null,null,null,null,null,null,null,null,null,null,null,null,null,null,null,null,null,null,null,null,null,null,null,null,null,"Tajikistan"]
[null,null,null,null,null,null,null,null,null,null,null,null,null,null,null,null,null,null,null,null,null,null,null,null,null,"Tanzania"]
[null,null,null,null,null,null,null,null,null,null,null,null,null,null,null,null,null,null,null,null,null,null,null,null,null,"Thailand"]
[null,null,null,null,null,null,null,null,null,null,null,null,null,null,null,null,null,null,null,null,null,null,null,null,null,"Togo"]
[null,null,null,null,null,null,null,null,null,null,null,null,null,null,null,null,null,null,null,null,null,null,null,null,null,"Tonga"]
[null,null,null,null,null,null,null,null,null,null,null,null,null,null,null,null,null,null,null,null,null,null,null,null,null,"Trinidad & Tobago"]
[null,null,null,null,null,null,null,null,null,null,null,null,null,null,null,null,null,null,null,null,null,null,null,null,null,"Tunisia"]
[null,null,null,null,null,null,null,null,null,null,null,null,null,null,null,null,null,null,null,null,null,null,null,null,null,"Turkey"]
[null,null,null,null,null,null,null,null,null,null,null,null,null,null,null,null,null,null,null,null,null,null,null,null,null,"Turkmenistan"]
[null,null,null,null,null,null,null,null,null,null,null,null,null,null,null,null,null,null,null,null,null,null,null,null,null,"Uganda"]
[null,null,null,null,null,null,null,null,null,null,null,null,null,null,null,null,null,null,null,null,null,null,null,null,null,"Ukraine"]
[null,null,null,null,null,null,null,null,null,null,null,null,null,null,null,null,null,null,null,null,null,null,null,null,null,"United Arab Emirates"]
[null,null,null,null,null,null,null,null,null,null,null,null,null,null,null,null,null,null,null,null,null,null,null,null,null,"United Kingdom"]
[null,null,null,null,null,null,null,null,null,null,null,null,null,null,null,null,null,null,null,null,null,null,null,null,null,"USA"]
[null,null,null,null,null,null,null,null,null,null,null,null,null,null,null,null,null,null,null,null,null,null,null,null,null,"Uruguay"]
[null,null,null,null,null,null,null,null,null,null,null,null,null,null,null,null,null,null,null,null,null,null,null,null,null,"Uzbekistan"]
[null,null,null,null,null,null,null,null,null,null,null,null,null,null,null,null,null,null,null,null,null,null,null,null,null,"Vanuatu"]
[null,null,null,null,null,null,null,null,null,null,null,null,null,null,null,null,null,null,null,null,null,null,null,null,null,"Venezuela"]
[null,null,null,null,null,null,null,null,null,null,null,null,null,null,null,null,null,null,null,null,null,null,null,null,null,"Vietnam"]
[null,null,null,null,null,null,null,null,null,null,null,null,null,null,null,null,null,null,null,null,null,null,null,null,null,"Yemen"]
[null,null,null,null,null,null,null,null,null,null,null,null,null,null,null,null,null,null,null,null,null,null,null,null,null,"Zambia"]
[null,null,null,null,null,null,null,null,null,null,null,null,null,null,null,null,null,null,null,null,null,null,null,null,null,"Zimbabwe"]

{"sheet":"Simple Scoring Approach","index":1,"n_rows":257,"n_cols":37,"rows_kept":257,"cut":false,"hidden":false,"merged":[[238,19,238,21],[160,19,160,21],[158,19,158,21],[218,19,218,21],[230,19,230,21],[228,19,228,21],[226,19,226,21],[224,19,224,21],[200,19,200,21],[198,19,198,21],[192,19,192,21],[190,19,190,21],[186,19,186,21],[180,19,180,21],[178,19,178,21],[166,19,166,21],[164,19,164,21],[162,19,162,21],[216,19,216,21],[214,19,214,21],[212,19,212,21],[210,19,210,21],[204,19,204,21],[202,19,202,21],[206,17,206,20],[240,17,240,20],[234,17,234,20],[80,2,80,19],[7,20,11,28],[82,2,82,19],[83,2,83,19],[142,19,142,21],[81,2,81,19],[126,19,126,21],[124,19,124,21],[108,19,108,21],[174,19,174,21],[152,19,152,21],[150,19,150,21],[148,19,148,21],[146,19,146,21],[144,19,144,21],[168,19,168,21],[232,19,232,21],[140,19,140,21],[136,19,136,21],[91,2,91,19],[92,2,92,19],[1,1,1,11],[20,3,20,5],[182,17,182,20],[102,19,102,21],[104,19,104,21],[106,19,106,21],[110,19,110,21],[128,19,128,21],[85,2,85,19],[86,2,86,19],[87,2,87,19],[89,2,89,19],[88,2,88,19],[84,2,84,19],[12,20,13,24],[78,2,78,19],[79,2,79,19],[77,2,77,19],[108,1,108,7],[110,1,110,7],[116,1,116,7],[112,1,112,7],[90,2,90,19],[93,2,93,19],[102,1,102,7],[104,1,104,7],[144,1,144,7],[146,1,146,7],[148,1,148,7],[158,1,158,7],[150,1,150,7],[152,1,152,7],[118,1,118,7],[120,1,120,7],[122,1,122,7],[124,1,124,7],[126,1,126,7],[136,1,136,7],[132,1,132,7],[138,1,138,7],[244,1,244,7],[246,1,246,7],[128,1,128,7],[130,1,130,7],[171,1,171,7],[234,1,234,7],[220,1,220,7],[206,1,206,7],[218,1,218,7],[192,1,192,7],[198,1,198,7],[183,1,183,7],[186,1,186,7],[188,1,188,7],[190,1,190,7],[202,1,202,7],[204,1,204,7],[207,1,207,7],[176,1,176,7],[178,1,178,7],[180,1,180,7],[170,1,170,7],[212,1,212,7],[182,1,182,7],[230,1,230,7],[106,1,106,7],[242,1,242,7],[232,1,232,7],[237,1,237,7],[238,1,238,7],[240,1,240,7],[224,1,224,7],[226,1,226,7],[228,1,228,7],[214,1,214,7],[216,1,216,7],[210,1,210,7],[194,1,194,7],[200,1,200,7],[160,1,160,7],[162,1,162,7],[164,1,164,7],[154,1,154,7],[174,1,174,7],[166,1,166,7],[168,1,168,7],[140,1,140,7],[142,1,142,7],[108,23,108,24],[116,19,116,21],[138,19,138,21],[188,19,188,21],[176,19,176,21],[118,19,118,21],[122,19,122,21],[154,17,154,20],[132,17,132,20],[120,19,120,21],[130,19,130,21],[110,23,112,28]]}
[]
[null,{"$f":"IF(OR(projecttype='Assessment Details'!Z214,projecttype=\"\"),\"BREEAM International 2013 New Construction Pre-Assessment Estimator:                                Summary of Building Performance\",\"BREEAM International Bespoke 2013 New Construction Pre-Assessment Estimator:             Summary of Building Performance\")","v":"BREEAM International 2013 New Construction Pre-Assessment Estimator:                                Summary of Building Performance"}]
[null,{"$f":"IF(AD_Mandatory_fields_text=AIS_statement09,\"Warning: All Mandatory fields in the assessment details worksheet must be completed/defined to reveal the BREEAM rating and Summary of building performance.\",\"\")","v":"Warning: All Mandatory fields in the assessment details worksheet must be completed/defined to reveal the BREEAM rating and Summary of building performance."}]
[null,"Overall Building Performance"]
[]
[null,null,null,"Building name",null,{"$f":"IF(ISBLANK(ADBN),\"\",ADBN)","v":""}]
[]
[null,null,null,"Indicative BREEAM rating",null,{"$f":"BP_BREEAMRating","v":""},null,{"$f":"IF(ISERROR(IF(AIS_MinStand_rating_check=AIS_No,\"Note: the BREEAM rating has been pegged back to the minimum standards level achieved\",\"\")),\"\",IF(AIS_MinStand_rating_check=AIS_No,\"Note: the BREEAM rating has been limited to the minimum standards level achieved\",\"\"))","v":""}]
[]
[null,null,null,"Indicative total score",null,{"$f":"BP_OverallScore","v":""}]
[]
[null,null,null,"Min. standards level achieved",null,{"$f":"BP_MinStandards","v":""}]
[]
[null,"Building Performance by Key Environmental Performance Indicator",null,null,null,null,null,null,null,null,null,null,null,null,null,{"$f":"SUM(#REF!)","v":{"$error":"#REF!"}},null,{"$f":"SUM(#REF!)","v":{"$error":"#REF!"}}]
[null,"Energy (consumption/production)",null,null,null,null,null,"Life cycle stage",null,"Measurement",null,"Intensity",null,"Units",null,"Total",null,"Units"]
[]
[null,null,null,null,null,"Building operation[1]",null,"Use",null,"Modelled",null,{"$f":"IF(Ene01_80=AIS_statement91,IF(OR(Ene01_05=\"\",Ene01_47=\"\"),AIS_units22,Ene01_05+Ene01_47),IF(Ene01_80=AIS_statement90,IF(Ene01_05=\"\",AIS_units22,Ene01_05)))","v":"INA"},null,"kWh/m2/yr",null,{"$f":"IF(Ene01_80=AIS_statement91,IF(OR(Ene01_05=\"\",Ene01_47=\"\"),AIS_units22,BP_KPI01*AD_GIA),IF(Ene01_80=AIS_statement90,IF(Ene01_05=\"\",AIS_units22,BP_KPI01*AD_GIA)))","v":"INA"},null,"kWh/yr"]
[]
[null,null,null,null,null,"Energy production[2]",null,"Use",null,"Modelled",null,{"$f":"IF(ISERROR(BP_KPI08/AD_GIA),AIS_units22,BP_KPI08/AD_GIA)","v":"INA"},null,"kWh/m2/yr",null,{"$f":"AIS_units22","v":"INA"},null,"kWh/yr"]
[]
[null,null,null,"Construction process[3]",null,null,null,{"$f":"IF(ADAS0=ADAS01,AIS_units22,AIS_construction)","v":"INA"},null,{"$f":"IF(ADAS0=ADAS01,AIS_units22,AIS_measured)","v":"INA"},null,{"$f":"IF(OR(ADAS0=ADAS01,Man03_01=AIS_No),AIS_units22,Man03_KPI02)","v":"INA"},null,{"$f":"IF(ADAS0=ADAS01,AIS_units22,AIS_units02)","v":"INA"},null,{"$f":"IF(OR(ADAS0=ADAS01,Man03_01=AIS_No),AIS_units22,Man03_kPI01)","v":"INA"},null,{"$f":"IF(ADAS0=ADAS01,AIS_units22,AIS_units01)","v":"INA"}]
[]
[null,null,null,null,null,"Transport[4]",null,{"$f":"IF(ADAS0=ADAS01,AIS_units22,AIS_construction)","v":"INA"},null,{"$f":"IF(ADAS0=ADAS01,AIS_units22,AIS_measured)","v":"INA"},null,{"$f":"IF(ISERROR(IF(OR(ADAS0=ADAS01,Man03_03=AIS_No),AIS_units22,Man03_KPI09+Man03_KPI14)),AIS_units22,IF(OR(ADAS0=ADAS01,Man03_03=AIS_No),AIS_units22,Man03_KPI09+Man03_KPI14) )","v":"INA"},null,{"$f":"IF(ADAS0=ADAS01,AIS_units22,AIS_units10)","v":"INA"},null,{"$f":"IF(OR(ADAS0=ADAS01,Man03_03=AIS_No,AND(Man03_KPI08=\"\",Man03_KPI13=\"\")),AIS_units22,Man03_KPI08+Man03_KPI13)","v":"INA"},null,{"$f":"IF(ADAS0=ADAS01,AIS_units22,AIS_units08)","v":"INA"}]
[]
[null,"Greenhouse Gas Emissions"]
[]
[null,null,null,null,null,"Building operation[1]",null,"Use",null,"Modelled",null,{"$f":"IF(Ene01_80=AIS_statement91,IF(OR(Ene01_07=\"\",Ene01_49=\"\"),AIS_units22,Ene01_07+Ene01_49),IF(Ene01_80=AIS_statement90,IF(Ene01_07=\"\",AIS_units22,Ene01_07)))","v":"INA"},null,"kgCO2eq/m2/yr",null,{"$f":"IF(Ene01_80=AIS_statement91,IF(OR(Ene01_07=\"\",Ene01_49=\"\"),AIS_units22,BP_KPI09*AD_GIA),IF(Ene01_80=AIS_statement90,IF(Ene01_07=\"\",AIS_units22,BP_KPI09*AD_GIA)))","v":"INA"},null,"kgCO2eq/yr"]
[]
[null,null,null,null,null,"Embodied[5]",null,"Cradle-to-grave",null,"Measured",null,{"$f":"IF(Mat01_KPI01=AIS_Missing_data,AIS_units22,Mat01_KPI02)","v":"INA"},null,"kgCO2eq/m2",null,{"$f":"IF(Mat01_KPI01=AIS_Missing_data,AIS_units22,Mat01_KPI01)","v":"INA"},null,"kgCO2eq"]
[]
[null,null,null,null,null,null,null,null,null,null,null,null,null,null,null,"Proportion of applicable main building elements that data reported covers",null,{"$f":"IF(Mat01_KPI01=AIS_Missing_data,AIS_units22,Mat01_KPI03)","v":"INA"}]
[]
[null,null,null,null,null,"Construction process[3]",null,{"$f":"IF(ADAS0=ADAS01,AIS_units22,AIS_construction)","v":"INA"},null,{"$f":"IF(ADAS0=ADAS01,AIS_units22,AIS_measured)","v":"INA"},null,{"$f":"IF(OR(ADAS0=ADAS01,Man03_01=AIS_No),AIS_units22,Man03_KPI04)","v":"INA"},null,{"$f":"IF(ADAS0=ADAS01,AIS_units22,AIS_units03)","v":"INA"},null,{"$f":"IF(OR(ADAS0=ADAS01,Man03_01=AIS_No),AIS_units22,Man03_KPI03)","v":"INA"},null,{"$f":"IF(ADAS0=ADAS01,AIS_units22,AIS_units05)","v":"INA"}]
[]
[null,null,null,null,null,"Transport[4]",null,{"$f":"IF(ADAS0=ADAS01,AIS_units22,AIS_construction)","v":"INA"},null,{"$f":"IF(ADAS0=ADAS01,AIS_units22,AIS_measured)","v":"INA"},null,{"$f":"IF(ISERROR(IF(OR(ADAS0=ADAS01,Man03_03=AIS_No),AIS_units22,Man03_KPI11+Man03_KPI16)),AIS_units22,IF(OR(ADAS0=ADAS01,Man03_03=AIS_No),AIS_units22,Man03_KPI11+Man03_KPI16))","v":"INA"},null,{"$f":"IF(ADAS0=ADAS01,AIS_units22,AIS_units04)","v":"INA"},null,{"$f":"IF(OR(ADAS0=ADAS01,Man03_03=AIS_No,AND(Man03_KPI10=\"\",Man03_KPI15=\"\")),AIS_units22,Man03_KPI10+Man03_KPI15)","v":"INA"},null,{"$f":"IF(ADAS0=ADAS01,AIS_units22,AIS_units05)","v":"INA"}]
[]
[null,null,null,null,null,"Direct GHG emissions - Refrigerants[5]",null,"Use",null,"Modelled",null,{"$f":"IF(Pol01_02=AIS_No,0,IF(Pol01_07=\"\",AIS_units22,Pol01_07))","v":"INA"},null,"KgCO2eq/kWcoolth",null,{"$f":"IF(ISERROR(IF(Pol01_02=AIS_No,0,IF(Pol01_07=\"\",AIS_units22,BP_KPI17*Pol01_21))),AIS_units22,IF(Pol01_02=AIS_No,0,IF(Pol01_07=\"\",AIS_units22,BP_KPI17*Pol01_21)))","v":"INA"},null,"KgCO2eq"]
[null,"Emissions to outdoor air, soil and water"]
[]
[null,null,null,null,null,"Nitrogen Oxides (NOx)[6]",null,"Use",null,"Measured",null,{"$f":"IF(OR(Pol02_20=\"\",AIS_units22),AIS_units22,SUM(IF(OR(Pol02_29=\"INA\",Pol02_29=\"N/A\"),0,Pol02_29))+(IF(OR(Pol02_21=\"INA\",Pol02_21=\"N/A\"),0,Pol02_21))+(IF(OR(Pol02_20=\"INA\",Pol02_20=\"N/A\",Pol02_20=\"HIB\"),0,Pol02_20)))","v":"INA"},null,"mg/kWh",null,{"$f":"IF(OR(Pol01_KPI02=\"\",Pol01_KPI02=AIS_units22),AIS_units22,(Pol01_KPI02*AD_GIA)*(Pol02_20+Pol02_29)/1000000)","v":{"$error":"#VALUE!"}},null,"kg/yr"]
[null,"Use of freshwater resource "]
[]
[null,null,null,null,null,"Building operation[7]",null,{"$f":"IF(Wat01_01=AIS_option09,AIS_use,AIS_units22)","v":"INA"},null,{"$f":"IF(Wat01_01=AIS_option09,AIS_Modelled,AIS_units22)","v":"INA"},null,{"$f":"IF(OR(Wat01_KPI01=\"\",Wat01_KPI01=AIS_units22),AIS_units22,IF(Wat01_01=AIS_option09,Wat01_KPI01,AIS_units22))","v":"INA"},null,{"$f":"IF(Wat01_01=AIS_option09,AIS_units14,AIS_units22)","v":"INA"},null,{"$f":"IF(OR(Wat01_KPI02=\"\",Wat01_KPI01=\"\",Wat01_KPI02=AIS_units22,Wat01_KPI01=AIS_units22),AIS_units22,IF(Wat01_01=AIS_option09,Wat01_KPI02*Wat01_KPI01,AIS_units22))","v":"INA"},null,{"$f":"IF(Wat01_01=AIS_option09,AIS_units26,AIS_units22)","v":"INA"}]
[]
[null,null,null,null,null,"Construction process[8]",null,{"$f":"IF(ADAS0=ADAS01,AIS_units22,AIS_use)","v":"INA"},null,{"$f":"IF(ADAS0=ADAS01,AIS_units22,AIS_measured)","v":"INA"},null,{"$f":"IF(OR(ADAS0=ADAS01,Man03_02=AIS_No),AIS_units22,Man03_KPI06)","v":"INA"},null,{"$f":"IF(ADAS0=ADAS01,AIS_units22,AIS_units06)","v":"INA"},null,{"$f":"IF(OR(ADAS0=ADAS01,Man03_02=AIS_No),AIS_units22,Man03_KPI05)","v":"INA"},null,{"$f":"IF(ADAS0=ADAS01,AIS_units22,AIS_units07)","v":"INA"}]
[null,"Construction waste and recovery"]
[]
[null,null,null,null,null,"Construction waste generated[9]",null,{"$f":"AIS_construction","v":"Construction"},null,{"$f":"IF(ADAS0=ADAS01,AIS_target,AIS_measured)","v":"Target"},null,{"$f":"Wst01_generationKPI","v":1},null,{"$f":"Wst01_KPI1units","v":"m3/100m2"},null,{"$f":"IF(OR(Wst01_01=AIS_No,Wst01_06=AIS_No),AIS_units22,IF(OR(Wst01_02=\"\",Wst01_02=AIS_units22),AIS_units22,Wst01_03))","v":"INA"},null,{"$f":"IF(Wst01_04=AIS_units18,AIS_units20,AIS_units21)","v":"tonnes"}]
[]
[null,null,null,null,null,"Construction waste diverted from landfill[10]",null,{"$f":"AIS_construction","v":"Construction"},null,{"$f":"IF(ADAS0=ADAS01,AIS_target,AIS_measured)","v":"Target"},null,{"$f":"Wst01_KPI2","v":0},null,{"$f":"Wst01_KPI2units","v":"m3/100m2"},null,{"$f":"IF(OR(Wst01_01=AIS_No,Wst01_06=AIS_No),AIS_units22,IF(OR(Wst01_05=\"\",Wst01_05=AIS_units22),AIS_units22,Wst01_06))","v":"INA"},null,{"$f":"IF(Wst01_04=AIS_units18,AIS_units20,AIS_units21)","v":"tonnes"}]
[]
[null,null,null,null,null,"Demolition waste diverted from landfill[11]",null,{"$f":"IF(Wst01_06=AIS_NA,\"-\",AIS_construction)","v":"Construction"},null,{"$f":"IF(Wst01_06=AIS_NA,\"-\",IF(ADAS0=ADAS01,AIS_target,AIS_measured))","v":"Target"},null,{"$f":"IF(Wst01_06=AIS_NA,\"-\",IF(OR(Wst01_01=AIS_No,Wst01_06=AIS_No),AIS_units22,IF(OR(Wst01_07=\"\",Wst01_07=AIS_units22),AIS_units22,Wst01_07)))","v":"INA"},null,{"$f":"IF(Wst01_06=AIS_NA,\"-\",AIS_units12)","v":"%"},null,{"$f":"IF(Wst01_06=AIS_NA,\"-\",IF(OR(Wst01_01=AIS_No,Wst01_06=AIS_No,ADAS0=ADAS01),AIS_units22,IF(OR(Wst01_29=\"\",Wst01_29=AIS_units22),AIS_units22,Wst01_29)))","v":"INA"},null,{"$f":"IF(Wst01_06=AIS_NA,\"-\",IF(AND(Wst01_06=AIS_No,Wst01_04=AIS_units18),AIS_units20,IF(AND(Wst01_06=AIS_No,Wst01_04=AIS_units21),AIS_units21,IF(ADAS0=ADAS01,AIS_units22,IF(Wst01_04=AIS_units18,AIS_units20,AIS_units21)))))","v":"INA"}]
[]
[null,null,null,null,null,"Demolition waste to disposal[11]",null,{"$f":"IF(Wst01_06=AIS_NA,\"-\",AIS_construction)","v":"Construction"},null,{"$f":"IF(Wst01_06=AIS_NA,\"-\",IF(ADAS0=ADAS01,AIS_target,AIS_measured))","v":"Target"},null,{"$f":"IF(Wst01_06=AIS_NA,\"-\",IF(OR(Wst01_01=AIS_No,Wst01_06=AIS_No),AIS_units22,IF(OR(Wst01_29=\"\",Wst01_29=AIS_units22),AIS_units22,1-BP_KPI31)))","v":"INA"},null,{"$f":"IF(Wst01_06=AIS_NA,\"-\",AIS_units12)","v":"%"},null,{"$f":"IF(Wst01_06=AIS_NA,\"-\",IF(OR(Wst01_01=AIS_No,Wst01_06=AIS_No,ADAS0=ADAS01),AIS_units22,IF(OR(Wst01_29=\"\",Wst01_29=AIS_units22),AIS_units22,Wst01_08)))","v":"INA"},null,{"$f":"IF(Wst01_06=AIS_NA,\"-\",IF(AND(Wst01_06=AIS_No,Wst01_04=AIS_units18),AIS_units20,IF(AND(Wst01_06=AIS_No,Wst01_04=AIS_units21),AIS_units21,IF(ADAS0=ADAS01,AIS_units22,IF(Wst01_04=AIS_units18,AIS_units20,AIS_units21)))))","v":"INA"}]
[]
[null,null,null,null,null,"Material for re-use[12]",null,{"$f":"AIS_construction","v":"Construction"},null,{"$f":"IF(ADAS0=ADAS01,AIS_target,AIS_measured)","v":"Target"},null,{"$f":"IF(OR(Wst01_01=AIS_No,Wst01_06=AIS_No),AIS_units22,IF(OR(Wst01_09=\"\",Wst01_09=AIS_units22),AIS_units22,BP_KPI38/AD_GIA))","v":"INA"},null,{"$f":"IF(Wst01_04=AIS_units18,AIS_units16,AIS_units17)","v":"tonnes/100m2"},null,{"$f":"IF(OR(Wst01_01=AIS_No,Wst01_06=AIS_No),AIS_units22,IF(OR(Wst01_09=\"\",Wst01_09=AIS_units22),AIS_units22,Wst01_09))","v":"INA"},null,{"$f":"IF(Wst01_04=AIS_units18,AIS_units20,AIS_units21)","v":"tonnes"}]
[]
[null,null,null,null,null,"Material for recycling[12]",null,{"$f":"AIS_construction","v":"Construction"},null,{"$f":"IF(ADAS0=ADAS01,AIS_target,AIS_measured)","v":"Target"},null,{"$f":"IF(OR(Wst01_01=AIS_No,Wst01_06=AIS_No),AIS_units22,IF(OR(Wst01_10=\"\",Wst01_10=AIS_units22),AIS_units22,BP_KPI40/AD_GIA))","v":"INA"},null,{"$f":"IF(Wst01_04=AIS_units18,AIS_units16,AIS_units17)","v":"tonnes/100m2"},null,{"$f":"IF(OR(Wst01_01=AIS_No,Wst01_06=AIS_No),AIS_units22,IF(OR(Wst01_10=\"\",Wst01_10=AIS_units22),AIS_units22,Wst01_10))","v":"INA"},null,{"$f":"IF(Wst01_04=AIS_units18,AIS_units20,AIS_units21)","v":"tonnes"}]
[]
[null,null,null,null,null,"Material for energy recovery[12]",null,{"$f":"AIS_construction","v":"Construction"},null,{"$f":"IF(ADAS0=ADAS01,AIS_target,AIS_measured)","v":"Target"},null,{"$f":"IF(OR(Wst01_01=AIS_No,Wst01_06=AIS_No),AIS_units22,IF(OR(Wst01_11=\"\",Wst01_11=AIS_units22),AIS_units22,BP_KPI42/AD_GIA))","v":"INA"},null,{"$f":"IF(Wst01_04=AIS_units18,AIS_units16,AIS_units17)","v":"tonnes/100m2"},null,{"$f":"IF(OR(Wst01_01=AIS_No,Wst01_06=AIS_No),AIS_units22,IF(OR(Wst01_11=\"\",Wst01_11=AIS_units22),AIS_units22,Wst01_11))","v":"INA"},null,{"$f":"IF(Wst01_04=AIS_units18,AIS_units20,AIS_units21)","v":"tonnes"}]
[]
[null,null,null,null,null,"Hazardous waste to disposal[12]",null,{"$f":"AIS_construction","v":"Construction"},null,{"$f":"IF(ADAS0=ADAS01,AIS_target,AIS_measured)","v":"Target"},null,{"$f":"IF(OR(Wst01_01=AIS_No,Wst01_06=AIS_No),AIS_units22,IF(OR(Wst01_12=\"\",Wst01_12=AIS_units22),AIS_units22,BP_KPI36/AD_GIA))","v":"INA"},null,{"$f":"IF(Wst01_04=AIS_units18,AIS_units16,AIS_units17)","v":"tonnes/100m2"},null,{"$f":"IF(OR(Wst01_01=AIS_No,Wst01_06=AIS_No),AIS_units22,IF(OR(Wst01_12=\"\",Wst01_12=AIS_units22),AIS_units22,Wst01_12))","v":"INA"},null,{"$f":"IF(Wst01_04=AIS_units18,AIS_units20,AIS_units21)","v":"tonnes"}]
[null,"Sourcing of materials"]
[]
[null,null,null,null,null,"Materials responsibly sourced[11]",null,"Construction",null,"Measured",null,{"$f":"IF(Mat03_03=AIS_No,AIS_units22,Mat03_03)","v":"INA"},null,"%",null,"-",null,"-"]
[null,"Thermal comfort"]
[null,null,null,null,null,"Predicted percentage dissatisfied (PPD)[12]",null,"Use",null,"Modelled",null,{"$f":"IF(OR(Hea03_12=\"\",Hea03_12=AIS_units22),AIS_units22,Hea03_12)","v":"INA"},null,"%",null,"INA",null,"INA"]
[]
[null,null,null,null,null,"Predicted mean vote (PMV)[12a]",null,"Use",null,"Modelled",null,{"$f":"IF(OR(Hea03_12a=\"\",Hea03_12a=AIS_units22),AIS_units22,Hea03_12a)","v":"INA"},null,"PMV",null,"INA",null,"INA"]
[null,"Indoor Air Quality"]
[]
[null,null,null,null,null,"Formaldehyde concentration level[13]",null,{"$f":"IF(ADAS0=ADAS01,AIS_units22,AIS_use)","v":"INA"},null,{"$f":"IF(ADAS0=ADAS01,AIS_units22,AIS_measured)","v":"INA"},null,{"$f":"IF(ADAS0=ADAS01,\"-\",IF(Hea02_03=AIS_No,AIS_units22,IF(OR(Hea02_KPI01=\"\",Hea02_KPI01=AIS_units22),AIS_units22,Hea02_KPI01)))","v":"-"},null,{"$f":"IF(ADAS0=ADAS01,AIS_units22,AIS_units11)","v":"INA"},null,{"$f":"AIS_units22","v":"INA"},null,{"$f":"AIS_units22","v":"INA"}]
[]
[null,null,null,null,null,"Total volatile organic compound concentration[13]",null,{"$f":"IF(ADAS0=ADAS01,AIS_units22,AIS_construction)","v":"INA"},null,{"$f":"IF(ADAS0=ADAS01,AIS_units22,AIS_measured)","v":"INA"},null,{"$f":"IF(ADAS0=ADAS01,AIS_units22,IF(Hea02_03=AIS_No,AIS_units22,IF(OR(Hea02_KPI02=\"\",Hea02_KPI02=AIS_units22),AIS_units22,Hea02_KPI02)))","v":"INA"},null,{"$f":"IF(ADAS0=ADAS01,AIS_units22,AIS_units11)","v":"INA"},null,{"$f":"AIS_units22","v":"INA"},null,{"$f":"AIS_units22","v":"INA"}]
[]
[null,"Notes"]
[]
[null,1,"Modelled using approved building energy software compliant with the BREEAM definition. Modelling includes building energy consumption resulting from the service energy within the building."]
[null,2,"The reported impact includes technologies that produce energy (on-site and/or near-site) as defined by Directive 2009/28/EC of the European Parliament and of the Council of 23 April 2009 on the promotion of the use of energy from renewable sources and amending and subsequently repealing Directives 2001/77/EC and 2003/30/EC."]
[null,3,"The reported impact includes energy consumption from construction plant, equipment and site accommodation. This KPI is not assessed/reported at the design stage of assessment/certification."]
[null,4,"The reported impact covers transport of the construction materials that make-up the main building elements and ground works and landscaping materials (from the factory gate to the site) and construction waste (from the construction gate to waste disposal processing / recovery centre gate). Main building elements are defined in the BREEAM International New Construction Technical Guide (SD5075). This KPI is not assessed/reported at the design stage of assessment/certification."]
[null,5,"The reported impact covers the construction materials that make-up the main building elements (over a 60 year study period). Main building elements are defined in the BREEAM 2011 New Construction Technical Guide (SD5073). The data is quantified using BRE's Environmental Profiles Methodology. The Environmental Profiles Methodology has been peer reviewed to comply with BS ISO 14040 and represents the Product Category Rules for BRE Global’s environmental labelling scheme (EPD - ISO 14025, Type III) for construction products and elements."]
[null,5,"The reported impact is for a 10 year study period. The calculation of the Direct Effect Life Cycle CO2eq emissions used by BREEAM is based on the Total Equivalent Warming Impact (TEWI) calculation method for new stationary refrigeration and air conditioning systems, as described in Annex B of BS EN 378-1:2008, IPCC/TEAP Special Report 2005 and British Refrigeration Association’s (BRA) Guideline Methods of Calculating TEWI."]
[null,6,"The reported impact covers emissions from either one or a combination of space heating, cooling and hot water heating (refer to Pol02 Assessment Issue for scope of emissions)"]
[null,7,"The reported impact includes net water consumption from the micro-components utilised by building occupants for sanitary purposes. The impact accounts for  water recycling/rainwater collection, where used for permissible non-potable water demands (For further detail refer to BREEAM International New Construction Technical Guide (SD5075))."]
[null,8,"The reported impact is net water consumption i.e. accounts for any water recycling/rainwater collection used to off-set a potable site demand. This KPI is not assessed/reported at the design stage of assessment/certification."]
[null,9,"The reported impact covers non-hazardous waste generated. Where assessed and reported at the design stage of assessment this KPI is based on the target as required in assessment criterion 1."]
[null,10,"The reported impact covers non-hazardous waste diverted from landfill."]
[null,11,"The reported impact covers the proportion of the key building elements present and assessed by BREEAM that are responsibly sourced, where responsibly sourced is defined as follows; where at least 80% of the materials that make-up an element achieve certification in accordance with one of the responsible sourcing schemes defined in table - 41 of the BREEAM International New Construction Technical Guide (SD5075)."]
[null,12,"The reported impact covers the Predicted percentage dissatisfied (PPD). This is an index that establishes a quantitative prediction of the percentage of thermally dissatisfied people who feel too cool or too warm. For the purposes of ISO 7730, thermally dissatisfied people are those who will feel hot, warm, cool or cold (refer to the BREEAM International New Construction Technical Guide (SD5075) for further detail)."]
[null,"12a","Predicted Mean Vote (PMV) The PMV is an index that predicts the mean votes of a large group of persons on the seven-point thermal sensation scale based on the heat balance of the human body. Thermal balance is obtained when the internal heat production in the body is equal to the loss of heat to the environment (refer to the BREEAM International New Construction Technical Guide (SD5075) for further detail)."]
[null,13,"The total volatile organic compound (TVOC) concentration is measured post construction (but pre-occupancy) over 8 hours. Formaldehyde concentration level is measured post construction (but pre-occupancy) averaged over 30 minutes. Both KPI's are measured in accordance with ISO standards (refer to the BREEAM International New Construction Technical Manual for relevant standard numbers. At the design stage of assessment no data is available for this KPI as they are both measured once the building has been constructed (but pre-occupancy) for the purpose of post construction assessment."]
[null,null,"\"INA\" = Indicator Not Assessed. This will be the case where either the data required for the KPI is not gathered/measured by the building's project team or not assessed/quantified in BREEAM for a particular building type or assessment stage e.g. energy consumption for construction process at the design stage of assessment."]
[null,null,"\"-\" = KPI not applicable to building being assessed."]
[null,"Simple approach: Indicative Building Performance by Environmental Section and Assessment Issue",null,null,null,null,null,null,null,null,null,null,null,null,null,null,null,null,null,null,null,null,null,null,null,null,null,null,null,null,null,null,null,null,null,null,"Man04b credits"]
[null,null,null,null,null,null,null,null,null,null,null,null,null,null,null,null,null,null,null,null,null,null,null,null,null,null,null,null,null,null,null,null,null,null,"Please select:",null,"Please select:"]
[null,null,null,null,null,null,null,null,null,null,null,null,null,null,null,null,null,null,null,null,null,null,null,null,null,null,null,null,null,null,null,null,null,null,"Yes",null,{"$f":"IF(ADBT0=ADBT8,\"Excellent\",\"Outstanding\")","v":"Outstanding"}]
[null,null,null,null,null,null,null,null,null,null,null,null,null,null,null,null,null,null,null,null,null,null,null,null,null,null,null,null,null,null,null,null,null,null,"No",null,{"$f":"IF(ADBT0=ADBT8,\"Outstanding\",\"\")","v":""}]
[null,null,null,null,null,null,null,null,null,"Indicative no. credits available",null,"Indicative no. credits Achieved (detailed approach)",null,"Indicative no. credits Achieved (simple approach)",null,"Indicative contribution to score",null,"Minimum standards level achieved for issue",null,"Additional Minimum standards criteria"]
[]
[null,"MANAGEMENT"]
[]
[null,{"$f":"Man_01","v":"Man01 Sustainable Procurement"},null,null,null,null,null,null,null,{"$f":"Man01_credits","v":9},null,{"$f":"Man01_Tot","v":0},null,null,null,{"$f":"Man01_39","v":0},null,{"$f":"Man01_37","v":"Unclassified"},null,"N/A"]
[]
[null,{"$f":"Man_02","v":"Man02 Responsible Construction Practices"},null,null,null,null,null,null,null,{"$f":"Man02_credits","v":2},null,{"$f":"Man02_Tot","v":0},null,null,null,{"$f":"Man02_12","v":0},null,{"$f":"Man02_minstd","v":"Very Good"},null,"N/A"]
[]
[null,{"$f":"Man_03","v":"Man03 Construction Site Impacts"},null,null,null,null,null,null,null,{"$f":"Man03_credits","v":5},null,{"$f":"Man03_Tot","v":0},null,null,null,{"$f":"Man03_18","v":0},null,{"$f":"Man03_minstd","v":"N/A"},null,"N/A"]
[]
[null,{"$f":"Man_04","v":"Man04 Stakeholder Participation"},null,null,null,null,null,null,null,{"$f":"Man04_credits","v":4},null,{"$f":"Man04_tot","v":0},null,null,null,{"$f":"Man04_cont","v":0},null,{"$f":"Man04_minstd","v":"Pass"},null,"Which minimum standards will be achieved?",null,null,null,"Please select:"]
[]
[null,{"$f":"Man_05","v":"Man05 Life cycle cost and service life planning"},null,null,null,null,null,null,null,{"$f":"Man05_credits","v":3},null,{"$f":"Man05_tot","v":0},null,null,null,{"$f":"Man05_cont","v":0},null,{"$f":"Man05_minstd","v":"N/A"},null,"N/A",null,null,null,{"$f":"IF(ADBT0<>ADBT8,\"Note: For an Outstanding rating, the Building user information credit must be achieved\",IF(Man04_user_mst=HUG, \"Note: For an Excellent rating, the Home user information credit must be achieved\",\"Note: For an Outstanding rating, the Home user Information and Inclusive & Accessibile design credit must be achieved\"))","v":"Note: For an Outstanding rating, the Building user information credit must be achieved"}]
[]
[null,"Total indicative environmental section performance",null,null,null,null,null,null,null,{"$f":"BP_01","v":23},null,{"$f":"SUM(L103,L105,L107,L109,L111)","v":0},null,{"$f":"N103+N105+N107+N109+N111","v":0},null,{"$f":"SUM(P103,P105,P107,P109,P111)","v":0}]
[]
[null,"HEALTH & WELLBEING"]
[]
[null,{"$f":"Hea_01","v":"Hea01 Visual Comfort"},null,null,null,null,null,null,null,{"$f":"Hea01_credits","v":3},null,{"$f":"Hea01_tot","v":0},null,null,null,{"$f":"Hea01_27","v":0},null,{"$f":"Hea01_minstd","v":"Unclassified"},null,"Will high frequency ballasts be fitted?",null,null,null,"Please select:"]
[]
[null,{"$f":"Hea_02","v":"Hea02 Indoor Air Quality"},null,null,null,null,null,null,null,{"$f":"IF(Hea02_credits=\"N/A\",0,Hea02_credits)","v":4},null,{"$f":"Hea02_tot","v":0},null,null,null,{"$f":"Hea02_26","v":0},null,{"$f":"Hea02_minstd","v":"Unclassified"},null,"Will all asbestos materials be banned?",null,null,null,"Please select:"]
[]
[null,{"$f":"Hea_03","v":"Hea03 Thermal Comfort"},null,null,null,null,null,null,null,{"$f":"IF(Hea03_credits=\"N/A\",0,Hea03_credits)","v":2},null,{"$f":"Hea03_tot","v":0},null,null,null,{"$f":"Hea03_contr","v":0},null,{"$f":"Hea03_11","v":"N/A"},null,"N/A"]
[]
[null,{"$f":"Hea_04","v":"Hea04 Water Quality"},null,null,null,null,null,null,null,{"$f":"Hea04_credits","v":1},null,{"$f":"Hea04_tot","v":0},null,null,null,{"$f":"Hea04_13","v":0},null,{"$f":"Hea04_11","v":"Unclassified"},null,"Will criterion 1 be met?",null,null,null,"Please select:"]
[]
[null,{"$f":"Hea_05","v":"Hea05 Acoustic Performance"},null,null,null,null,null,null,null,{"$f":"Hea05_credits","v":2},null,{"$f":"Hea05_tot","v":0},null,null,null,{"$f":"Hea05_08","v":0},null,{"$f":"Hea05_minstd","v":"N/A"},null,"N/A"]
[]
[null,{"$f":"Hea_06","v":"Hea06 Safe Access"},null,null,null,null,null,null,null,{"$f":"IF(Hea06_credits=\"N/A\",0,Hea06_credits)","v":1},null,{"$f":"Hea06_tot","v":0},null,null,null,{"$f":"Hea06_contr","v":0},null,{"$f":"Hea06_minstd","v":"N/A"},null,"N/A"]
[]
[null,{"$f":"Hea_07","v":"Hea07 Hazards"},null,null,null,null,null,null,null,{"$f":"IF(Hea07_Credits=\"N/A\",0,Hea07_Credits)","v":1},null,{"$f":"Hea07_Tot","v":0},null,null,null,{"$f":"Hea07_contr","v":0},null,{"$f":"Hea07_minstd","v":"N/A"},null,"N/A"]
[]
[null,{"$f":"Hea_08","v":"Hea08 Private Space"},null,null,null,null,null,null,null,{"$f":"IF(Hea08_Credits=\"N/A\",0,Hea08_Credits)","v":0},null,{"$f":"Hea08_tot","v":0},null,null,null,{"$f":"Hea08_contr","v":"0.00%"},null,{"$f":"Hea08_minstd","v":"N/A"},null,"N/A"]
[]
[null,"Total indicative environmental section performance",null,null,null,null,null,null,null,{"$f":"BP_02+BP_02c","v":14},null,{"$f":"SUM(L117,L119,L121,L123,L125,L127,L129,L131)","v":0},null,{"$f":"SUM(N117,N119,N121,N123,N125,N127,N129,N131)","v":0},null,{"$f":"BP_HW_score_unmerged","v":0}]
[]
[null,"ENERGY"]
[]
[null,{"$f":"Ene_01","v":"Ene01 Energy Efficiency "},null,null,null,null,null,null,null,{"$f":"Ene01_credits","v":15},null,{"$f":"Ene01_tot","v":0},null,null,null,{"$f":"Ene01_42","v":0},null,{"$f":"Ene01_28","v":"Very Good"},null,"N/A"]
[]
[null,{"$f":"Ene_02","v":"Ene02 Energy Monitoring"},null,null,null,null,null,null,null,{"$f":"Ene02_credits","v":1},null,{"$f":"Ene02_tot","v":0},null,null,null,{"$f":"Ene02_13","v":0},null,{"$f":"Ene02_12","v":"Good"},null,"Will the first sub-metering credit be met?",null,null,null,"Please select:"]
[]
[null,{"$f":"Ene_03","v":"Ene03 External Lighting"},null,null,null,null,null,null,null,{"$f":"Ene03_credits","v":1},null,{"$f":"Ene03_tot","v":0},null,null,null,{"$f":"Ene03_06","v":0},null,{"$f":"Ene03_minstd","v":"N/A"},null,"N/A"]
[]
[null,{"$f":"Ene_04","v":"Ene04 Low and Zero Carbon Technology"},null,null,null,null,null,null,null,{"$f":"Ene04_credits","v":2},null,{"$f":"Ene04_tot","v":0},null,null,null,{"$f":"Ene04_20","v":0},null,{"$f":"Ene04_16","v":"Very Good"},null,"N/A"]
[]
[null,{"$f":"Ene_05","v":"Ene05 Energy Efficient Cold Storage"},null,null,null,null,null,null,null,{"$f":"IF(Ene05_credits=\"N/A\",0,Ene05_credits)","v":0},null,{"$f":"Ene05_tot","v":0},null,null,null,{"$f":"Ene05_21","v":"N/A"},null,{"$f":"Ene05_15","v":"N/A"},null,"N/A"]
[]
[null,{"$f":"Ene_06","v":"Ene06 Energy Efficient Transportation Systems"},null,null,null,null,null,null,null,{"$f":"IF(Ene06_credits=\"N/A\",0,Ene06_credits)","v":2},null,{"$f":"Ene06_tot","v":0},null,null,null,{"$f":"Ene06_12","v":0},null,{"$f":"Ene06_minstd","v":"N/A"},null,"N/A"]
[]
[null,{"$f":"Ene_07","v":"Ene07 Energy Efficient Laboratory Systems"},null,null,null,null,null,null,null,"N/A",null,"N/A",null,"N/A",null,"N/A",null,"N/A",null,"N/A"]
[]
[null,{"$f":"Ene_08","v":"Ene08 Energy Efficient Equipment"},null,null,null,null,null,null,null,{"$f":"Ene08_credits","v":2},null,{"$f":"Ene08_tot","v":0},null,null,null,{"$f":"Ene08_29","v":0},null,{"$f":"Ene08_minstd","v":"N/A"},null,"N/A"]
[]
[null,{"$f":"Ene_09","v":"Ene09 Drying Space"},null,null,null,null,null,null,null,{"$f":"IF(Ene09_credits=\"N/A\",0,Ene09_credits)","v":0},null,{"$f":"Ene09_tot","v":"N/A"},null,null,null,{"$f":"Ene09_10","v":"N/A"},null,{"$f":"Ene09_minstd","v":"N/A"},null,"N/A"]
[]
[null,"Total indicative environmental section performance",null,null,null,null,null,null,null,{"$f":"BP_03","v":23},null,{"$f":"SUM(L137,L139,L141,L143,L145,L147,L149,L151,L153)","v":0},null,{"$f":"SUM(N137,N139,N141,N143,N145,N147,N149,N151,N153)","v":0},null,{"$f":"BP_Energy_score","v":0}]
[]
[null,"TRANSPORT"]
[]
[null,{"$f":"Tra_01","v":"Tra01 Public Transport Accessibility "},null,null,null,null,null,null,null,{"$f":"IF(Tra01_credits=\"See instruction\",0,Tra01_credits)","v":0},null,{"$f":"Tra01_tot","v":0},null,null,null,{"$f":"TRa01_08","v":"See instruction"},null,{"$f":"Tra01_minstd","v":"N/A"},null,"N/A"]
[]
[null,{"$f":"Tra_02","v":"Tra02 Proximity to Amenities"},null,null,null,null,null,null,null,{"$f":"Tra02_credits","v":1},null,{"$f":"Tra02_tot","v":0},null,null,null,{"$f":"Tra02_07","v":"See instruction"},null,{"$f":"Tra02_minstd","v":"N/A"},null,"N/A"]
[]
[null,{"$f":"Tra_03","v":"Tra03  Alternative modes of transport "},null,null,null,null,null,null,null,{"$f":"Tra03_credits","v":2},null,{"$f":"Tra03_tot","v":0},null,null,null,{"$f":"Tra03_14","v":"See instruction"},null,{"$f":"Tra03_minstd","v":"N/A"},null,"N/A"]
[]
[null,{"$f":"Tra_04","v":"Tra04 Maximum Car Parking Capacity"},null,null,null,null,null,null,null,{"$f":"IF(Tra04_credits=\"N/A\",0,Tra04_credits)","v":2},null,{"$f":"Tra04_tot","v":0},null,null,null,{"$f":"Tra04_10","v":"N/A"},null,{"$f":"Tra04_minstd","v":"N/A"},null,"N/A"]
[]
[null,{"$f":"Tra_05","v":"Tra05 Travel Plan"},null,null,null,null,null,null,null,{"$f":"IF(Tra05_credits=\"N/A\",0,Tra05_credits)","v":1},null,{"$f":"Tra05_tot","v":0},null,null,null,{"$f":"Tra05_05","v":"N/A"},null,{"$f":"Tra05_minstd","v":"N/A"},null,"N/A"]
[]
[null,{"$f":"Tra_06","v":"Tra06 Home Office"},null,null,null,null,null,null,null,{"$f":"IF(Tra06_credits=\"N/A\",0,Tra06_credits)","v":0},null,{"$f":"Tra06_tot","v":0},null,null,null,{"$f":"Tra06_contr","v":0},null,{"$f":"Tra06_minstd","v":"N/A"},null,"N/A"]
[]
[null,"Total indicative environmental section performance",null,null,null,null,null,null,null,{"$f":"BP_04","v":"See note"},null,{"$f":"SUM(L159,L161,L163,L165,L167,L169)","v":0},null,{"$f":"SUM(N159,N161,N163,N165,N167,N169)","v":0},null,{"$f":"BP_Trans_score","v":0}]
[]
[null,"WATER"]
[]
[null,{"$f":"Wat_01","v":"Wat01 Water Consumption"},null,null,null,null,null,null,null,{"$f":"Wat01_credits","v":5},null,{"$f":"Wat01_tot","v":0},null,null,null,{"$f":"Wat01_15","v":0},null,{"$f":"Wat01_09","v":"Good"},null,"N/A"]
[]
[null,{"$f":"Wat_02","v":"Wat02 Water Monitoring"},null,null,null,null,null,null,null,{"$f":"Wat02_credits","v":1},null,{"$f":"Wat02_tot","v":0},null,null,null,{"$f":"Wat02_13","v":0},null,{"$f":"Wat02_11","v":"Pass"},null,"Meter on the mains supply specified?",null,null,null,"Please select:"]
[]
[null,{"$f":"Wat_03","v":"Wat03 Water Leak Detection and Prevention"},null,null,null,null,null,null,null,{"$f":"Wat03_credits","v":2},null,{"$f":"Wat03_tot","v":0},null,null,null,{"$f":"Wat03_10","v":0},null,{"$f":"Wat03_minstd","v":"N/A"},null,"N/A"]
[]
[null,{"$f":"Wat_04","v":"Wat04 Water Efficient Equipment"},null,null,null,null,null,null,null,{"$f":"IF(Wat04_credits=\"N/A\",0,Wat04_credits)","v":1},null,{"$f":"Wat04_tot","v":0},null,null,null,{"$f":"Wat04_06","v":0},null,{"$f":"Wat04_minstd","v":"N/A"},null,"N/A"]
[]
[null,"Total indicative environmental section performance",null,null,null,null,null,null,null,{"$f":"BP_05","v":9},null,{"$f":"SUM(L175,L177,L179,L181)","v":0},null,{"$f":"SUM(N175,N177,N179,N181)","v":0},null,{"$f":"BP_Water_score","v":0}]
[]
[null,"MATERIALS"]
[]
[null,{"$f":"Mat_01","v":"Mat01 Life Cycle Impacts"},null,null,null,null,null,null,null,{"$f":"Mat01_credits","v":6},null,{"$f":"Mat01_tot","v":0},null,null,null,{"$f":"Mat01_28","v":0},null,{"$f":"Mat01_minstd","v":"N/A"},null,"N/A"]
[]
[null,{"$f":"Mat_03","v":"Mat03 Responsible Sourcing"},null,null,null,null,null,null,null,{"$f":"Mat03_credits","v":3},null,{"$f":"Mat03_tot","v":0},null,null,null,{"$f":"Mat03_38","v":0},null,{"$f":"Mat03_36","v":"Excellent"},null,"Will all timber be legally harvested/traded?",null,null,null,"Please select:"]
[]
[null,{"$f":"Mat_04","v":"Mat04 Insulation"},null,null,null,null,null,null,null,{"$f":"Mat04_credits","v":1},null,{"$f":"Mat04_tot","v":0},null,null,null,{"$f":"Mat04_10","v":0},null,{"$f":"Mat04_minstd","v":"N/A"},null,"N/A"]
[]
[null,{"$f":"Mat_05","v":"Mat05 Designing for Robustness"},null,null,null,null,null,null,null,{"$f":"Mat05_credits","v":1},null,{"$f":"Mat05_tot","v":0},null,null,null,{"$f":"Mat05_06","v":0},null,{"$f":"Mat05_minstd","v":"N/A"},null,"N/A"]
[]
[null,"Total indicative environmental section performance",null,null,null,null,null,null,null,{"$f":"BP_06","v":11},null,{"$f":"SUM(L187,L189,L191,L193)","v":0},null,{"$f":"SUM(N187,N189,N191,N193)","v":0},null,{"$f":"BP_Materials_score","v":0}]
[]
[null,"WASTE"]
[]
[null,{"$f":"Wst_01","v":"Wst01 Construction Waste Management"},null,null,null,null,null,null,null,{"$f":"Wst01_credits","v":3},null,{"$f":"Wst01_tot","v":0},null,null,null,{"$f":"Wst01_28","v":0},null,{"$f":"Wst01_18","v":"Excellent"},null,"N/A"]
[]
[null,{"$f":"Wst_02","v":"Wst02 Recycled Aggregates"},null,null,null,null,null,null,null,{"$f":"Wst02_credits","v":1},null,{"$f":"Wst02_tot","v":0},null,null,null,{"$f":"Wst02_15","v":0},null,{"$f":"Wst02_minstd","v":"N/A"},null,"N/A"]
[]
[null,{"$f":"Wst_03","v":"Wst03 Operational Waste"},null,null,null,null,null,null,null,{"$f":"Wst03_credits","v":1},null,{"$f":"Wst03_tot","v":0},null,null,null,{"$f":"Wst03_13","v":0},null,{"$f":"Wst03_10","v":"Very Good"},null,"N/A"]
[]
[null,{"$f":"Wst_04","v":"Wst04 Speculative Floor and Ceiling Finishes"},null,null,null,null,null,null,null,{"$f":"IF(Wst04_credits=\"N/A\",0,Wst04_credits)","v":0},null,{"$f":"Wst04_tot","v":"N/A"},null,null,null,{"$f":"Wst04_09","v":"N/A"},null,{"$f":"Wst04_minstd","v":"N/A"},null,"N/A"]
[]
[null,"Total indicative environmental section performance",null,null,null,null,null,null,null,{"$f":"BP_07","v":5},null,{"$f":"SUM(L199,L201,L203,L205)","v":0},null,{"$f":"SUM(N199,N201,N203,N205)","v":0},null,{"$f":"BP_Waste_Score","v":0}]
[]
[null,"LAND USE & ECOLOGY"]
[]
[null,{"$f":"LE_01","v":"LE01 Site Selection"},null,null,null,null,null,null,null,{"$f":"LE01_credits","v":3},null,{"$f":"LE01_tot","v":0},null,null,null,{"$f":"LE01_08","v":0},null,{"$f":"LE01_minstd","v":"N/A"},null,"N/A"]
[]
[null,{"$f":"LE_02","v":"LE02 Ecological Value of Site and Protection of Ecological Features"},null,null,null,null,null,null,null,{"$f":"LE02_credits","v":2},null,{"$f":"LE02_tot","v":0},null,null,null,{"$f":"LE02_08","v":0},null,{"$f":"LE02_minstd","v":"N/A"},null,"N/A"]
[]
[null,{"$f":"LE_04","v":"LE04 Enhancing Site Ecology"},null,null,null,null,null,null,null,{"$f":"LE04_credits","v":3},null,{"$f":"LE04_tot","v":0},null,null,null,{"$f":"LE04_14","v":0},null,{"$f":"LE03_minstd","v":"N/A"},null,"N/A"]
[]
[null,{"$f":"LE_05","v":"LE05 Long Term Impact on Biodiversity"},null,null,null,null,null,null,null,{"$f":"LE05_credits","v":2},null,{"$f":"LE05_tot","v":0},null,null,null,{"$f":"LE05_15","v":0},null,{"$f":"LE05_minstd","v":"N/A"},null,"N/A"]
[]
[null,{"$f":"LE_06","v":"LE06 Building Footprint (Residential Only)"},null,null,null,null,null,null,null,{"$f":"LE06_creditsNA","v":0},null,{"$f":"LE06_tot","v":0},null,null,null,{"$f":"LE06_contr","v":0},null,{"$f":"LE06_minstd","v":"N/A"},null,"N/A"]
[]
[null,"Total indicative environmental section performance",null,null,null,null,null,null,null,{"$f":"BP_08","v":10},null,{"$f":"SUM(L211,L213,L215,L217,L219)","v":0},null,{"$f":"SUM(N211,N213,N215,N217,N219)","v":0},null,{"$f":"BP_LUE_score","v":0}]
[]
[null,"POLLUTION"]
[]
[null,{"$f":"Pol_01","v":"Pol01 Impact of Refrigerants"},null,null,null,null,null,null,null,{"$f":"IF(Pol01_credits=\"N/A\",0,Pol01_credits)","v":4},null,{"$f":"Pol01_tot","v":0},null,null,null,{"$f":"Pol01_20","v":0},null,{"$f":"Pol01_minstd","v":"N/A"},null,"N/A"]
[]
[null,{"$f":"Pol_02","v":"Pol02 NOx Emissions"},null,null,null,null,null,null,null,{"$f":"Pol02_credits","v":3},null,{"$f":"Pol02_tot","v":0},null,null,null,{"$f":"Pol02_27","v":0},null,{"$f":"Pol02_minstd","v":"N/A"},null,"N/A"]
[]
[null,{"$f":"Pol_03","v":"Pol03 Surface Water Run off"},null,null,null,null,null,null,null,{"$f":"Pol03_credits","v":5},null,{"$f":"Pol03_tot","v":0},null,null,null,{"$f":"Pol03_15","v":0},null,{"$f":"Pol03_minstd","v":"N/A"},null,"N/A"]
[]
[null,{"$f":"Pol_04","v":"Pol04 Reduction of Night Time Light Pollution"},null,null,null,null,null,null,null,{"$f":"Pol04_credits","v":1},null,{"$f":"Pol04_tot","v":0},null,null,null,{"$f":"Pol04_06","v":0},null,{"$f":"Pol04_minstd","v":"N/A"},null,"N/A"]
[]
[null,{"$f":"Pol_05","v":"Pol05 Noise Attenuation"},null,null,null,null,null,null,null,{"$f":"IF(Pol05_credits=\"N/A\",0,Pol05_credits)","v":1},null,{"$f":"Pol05_tot","v":0},null,null,null,{"$f":"Pol05_11","v":0},null,{"$f":"Pol05_minstd","v":"N/A"},null,"N/A"]
[]
[null,"Total indicative environmental section performance",null,null,null,null,null,null,null,{"$f":"BP_09+BP_09b","v":14},null,{"$f":"SUM(L225,L227,L229,L231,L233)","v":0},null,{"$f":"SUM(N225,N227,N229,N231,N233)","v":0},null,{"$f":"BP_Pol_score_unmerged","v":0}]
[]
[null,"INNOVATION"]
[]
[null,{"$f":"Inn_01","v":"Inn01 Innovation"},null,null,null,null,null,null,null,{"$f":"Inn01_credits","v":10},null,{"$f":"Inn01_tot","v":0},null,null,null,{"$f":"Inn01_04","v":0},null,{"$f":"Inn_minstd","v":"N/A"},null,"N/A"]
[]
[null,"Total indicative environmental section performance",null,null,null,null,null,null,null,{"$f":"Inn01_credits","v":10},null,{"$f":"Inn01_tot","v":0},null,{"$f":"N239","v":0},null,{"$f":"BP_Innovation_score","v":0}]
[]
[]
[]
[]
[]
[]
[null,null,null,null,null,null,null,null,null,null,null,null,null,null,null,null,null,null,null,null,null,null,null,null,null,null,null,null,null,{"$f":"#REF!","v":{"$error":"#REF!"}},null,{"$f":"#REF!","v":{"$error":"#REF!"}}]
[null,null,null,null,null,null,null,null,null,null,null,null,null,null,null,null,null,null,null,null,null,null,null,null,null,null,null,null,null,{"$f":"#REF!","v":{"$error":"#REF!"}},null,{"$f":"#REF!","v":{"$error":"#REF!"}}]
[null,null,null,null,null,null,null,null,null,null,null,null,null,null,null,null,null,null,null,null,null,null,null,null,null,null,null,null,null,{"$f":"#REF!","v":{"$error":"#REF!"}},null,{"$f":"#REF!","v":{"$error":"#REF!"}}]
[null,null,null,null,null,null,null,null,null,null,null,null,null,null,null,null,null,null,null,null,null,null,null,null,null,null,null,null,null,{"$f":"#REF!","v":{"$error":"#REF!"}},null,{"$f":"#REF!","v":{"$error":"#REF!"}}]
[null,null,null,null,null,null,null,null,null,null,null,null,null,null,null,null,null,null,null,null,null,null,null,null,null,null,null,null,null,{"$f":"#REF!","v":{"$error":"#REF!"}},null,{"$f":"#REF!","v":{"$error":"#REF!"}}]
[null,null,null,null,null,null,null,null,null,null,null,null,null,null,null,null,null,null,null,null,null,null,null,null,null,null,null,null,null,{"$f":"#REF!","v":{"$error":"#REF!"}},null,{"$f":"#REF!","v":{"$error":"#REF!"}}]
[null,null,null,null,null,null,null,null,null,null,null,null,null,null,null,null,null,null,null,null,null,null,null,null,null,null,null,null,null,{"$f":"#REF!","v":{"$error":"#REF!"}},null,{"$f":"#REF!","v":{"$error":"#REF!"}}]
[null,null,null,null,null,null,null,null,null,null,null,null,null,null,null,null,null,null,null,null,null,null,null,null,null,null,null,null,null,{"$f":"#REF!","v":{"$error":"#REF!"}},null,{"$f":"#REF!","v":{"$error":"#REF!"}}]
[null,null,null,null,null,null,null,null,null,null,null,null,null,null,null,null,null,null,null,null,null,null,null,null,null,null,null,null,null,{"$f":"#REF!","v":{"$error":"#REF!"}},null,{"$f":"#REF!","v":{"$error":"#REF!"}}]
[null,null,null,null,null,null,null,null,null,null,null,null,null,null,null,null,null,null,null,null,null,null,null,null,null,null,null,null,null,{"$f":"#REF!","v":{"$error":"#REF!"}},null,{"$f":"#REF!","v":{"$error":"#REF!"}}]

{"sheet":"Detailed Scoring Approach","index":2,"n_rows":1981,"n_cols":45,"rows_kept":1981,"cut":false,"hidden":false,"merged":[[633,1,634,1],[633,2,634,7],[635,2,635,7],[302,16,302,22],[255,13,257,13],[255,11,257,11],[296,1,296,15],[419,16,421,22],[516,1,516,15],[424,1,424,15],[519,16,522,21],[583,16,584,22],[587,16,589,21],[575,16,576,21],[422,16,423,22],[575,11,577,11],[577,1,577,7],[414,16,417,22],[390,16,393,22],[378,7,378,13],[385,2,385,5],[386,2,386,5],[410,16,410,22],[411,1,411,13],[375,9,375,11],[373,1,373,7],[373,9,373,15],[380,7,381,7],[380,1,381,5],[375,1,375,7],[388,2,388,5],[399,16,409,22],[389,1,389,5],[407,9,408,15],[384,9,385,15],[378,15,378,19],[866,16,868,21],[858,1,858,15],[861,16,864,21],[685,16,686,21],[598,1,598,15],[716,16,718,21],[680,1,680,15],[692,7,692,9],[707,1,707,15],[694,7,694,9],[716,9,716,15],[696,7,696,9],[623,16,626,21],[662,16,665,21],[630,11,631,11],[601,16,603,22],[627,16,628,22],[698,16,700,21],[642,2,642,7],[702,16,704,21],[632,16,633,22],[653,17,653,21],[654,17,654,21],[627,9,627,15],[755,16,758,21],[731,1,731,15],[1075,16,1076,22],[771,1,771,15],[750,1,750,15],[734,16,737,21],[996,1,996,15],[1051,16,1055,21],[816,1,816,15],[788,7,788,13],[1030,9,1030,13],[877,1,877,15],[925,1,925,7],[925,9,925,15],[929,11,929,13],[1006,1,1006,7],[1006,9,1006,15],[958,1,958,15],[917,1,917,15],[838,1,838,15],[977,1,977,15],[897,16,902,22],[1027,9,1027,13],[1010,16,1012,22],[1008,11,1008,13],[1369,16,1370,21],[1113,1,1113,15],[1138,1,1138,15],[1304,1,1304,15],[1289,11,1290,11],[1289,13,1290,13],[1281,1,1281,15],[1262,16,1263,22],[1236,16,1239,21],[1206,1,1206,15],[1265,16,1269,22],[1276,16,1280,22],[1258,16,1259,22],[1241,16,1246,22],[1247,16,1252,21],[1271,16,1274,22],[1145,9,1145,15],[1189,16,1190,22],[1094,1,1094,15],[1082,16,1082,22],[1378,1,1378,15],[1102,1,1102,7],[1064,1,1064,15],[1010,11,1010,13],[1343,1,1343,15],[1323,1,1323,15],[1257,1,1257,15],[1025,9,1025,11],[1160,1,1160,15],[1181,1,1181,15],[1229,1,1229,15],[1043,1,1043,15],[1010,1,1010,2],[1195,1,1195,7],[3,1,3,11],[384,2,384,5],[324,16,324,22],[26,16,28,22],[189,1,189,15],[198,11,199,11],[371,7,371,11],[55,9,55,15],[268,1,268,15],[322,16,322,22],[355,1,355,15],[315,1,315,15],[4,1,4,15],[45,1,45,15],[67,1,67,15],[113,1,113,15],[163,1,163,15],[79,15,80,15],[335,1,335,15],[366,16,369,22],[142,1,142,15],[378,1,378,5],[257,16,261,21],[79,11,80,11],[7,7,7,15],[247,1,247,15],[223,1,223,15],[53,9,53,13],[198,13,199,13],[31,16,32,22],[192,16,194,21],[226,16,228,21],[57,15,59,15],[79,13,80,13],[198,15,199,15],[656,17,656,21],[636,2,636,7],[637,2,637,7],[638,2,638,7],[411,16,412,22],[646,17,647,21],[646,16,647,16],[648,16,649,16],[648,17,649,21],[630,16,631,22],[617,1,617,15],[455,1,455,15],[474,1,474,15],[547,16,548,22],[569,1,569,15],[498,16,501,21],[495,1,495,15],[650,17,650,21],[651,17,651,21],[652,17,652,21],[655,17,655,21],[536,1,536,15],[540,16,542,21],[545,16,546,22],[639,2,639,7],[640,2,640,7],[641,2,641,7],[690,7,690,9],[687,9,687,15],[886,15,887,15],[785,15,802,15],[720,9,720,13],[935,1,935,15],[803,9,803,11],[653,1,659,15],[786,7,786,13],[804,1,804,7]]}
[null,"HIDDEN CONTENT AND FORUMULAE IS PRESENT WITHIN THESE COLUMNS. DO NOT DELETE OR ADD CONTENT OR COLOUMNS OR ROWS WITHOUT FIRST UN-HIDING ALL AND CHECKING FOR CONTENT THAT MAY BE HIDDEN.",null,null,null,null,null,null,null,null,null,null,null,null,null,null,null,null,null,null,null,null,"HIDDEN CONTENT AND FORUMULAE IS PRESENT WITHIN THESE COLUMNS. DO NOT DELETE OR ADD CONTENT OR COLOUMNS OR ROWS WITHOUT FIRST UN-HIDING ALL AND CHECKING FOR CONTENT THAT MAY BE HIDDEN.",null,null,null,null,null,null,null,null,null,null,null,null,null,null,null,"HIDDEN CONTENT AND FORUMULAE IS PRESENT WITHIN THESE COLUMNS. DO NOT DELETE OR ADD CONTENT OR COLOUMNS OR ROWS WITHOUT FIRST UN-HIDING ALL AND CHECKING FOR CONTENT THAT MAY BE HIDDEN."]
[]
[]
[null,{"$f":"IF(OR(projecttype='Assessment Details'!Z214,projecttype=\"\"),\"BREEAM International 2013 New Construction Pre-Assessment Estimator:                                           Assessment Issue Scoring\",\"BREEAM International Bespoke 2013 New Construction Pre-Assessment Estimator: Assessment Issue Scoring\")","v":"BREEAM International 2013 New Construction Pre-Assessment Estimator:                                           Assessment Issue Scoring"}]
[null,{"$f":"IF(AD_Mandatory_fields_text=AIS_statement09,\"Warning: All Mandatory fields in the assessment details worksheet must be completed/defined to reveal the applicable assessment issues.\",\"\")","v":"Warning: All Mandatory fields in the assessment details worksheet must be completed/defined to reveal the applicable assessment issues."}]
[]
[]
[null,null,null,null,null,"Building name",null,{"$f":"IF(ISBLANK(ADBN),\"\",ADBN)","v":""}]
[]
[null,null,null,null,null,"Indicative building score (%)",null,{"$f":"BP_OverallScore","v":""}]
[]
[null,null,null,null,null,"Indicative building rating",null,{"$f":"BP_BREEAMRating","v":""}]
[]
[null,null,null,null,null,"Minimum standards level achieved",null,{"$f":"BP_MinStandards","v":""}]
[null,"This tab has been disabled as the simple approach for estimating the BREEAM score has been selected in the Assessment Details tab"]
[null,"MANAGEMENT"]
[]
[null,"Man01 Sustainable Procurement"]
[]
[null,null,null,null,null,"No. of BREEAM credits available",null,{"$f":"SUM(L25:L33)","v":9},null,null,null,null,null,"Available contribution to overall score",null,{"$f":"(BP_32/BP_01)*Man01_credits","v":4.6956521739130432E-2}]
[]
[null,null,null,null,null,"No. of BREEAM innovation credits available",null,1,null,null,null,null,null,"Minimum standards applicable",null,"Yes"]
[null,"Assessment Criteria",null,null,null,null,null,null,null,"Compliant?",null,"Credits available",null,"Credits achieved",null,"Shell & Core option?"]
[]
[null,null,null,null,null,null,null,"Will roles, responsibilities and a training schedule be defined in accordance with BREEAM?",null,"No",null,1,null,{"$f":"IF(Man01_01=AIS_Yes,1,0)","v":0},null,"N/A"]
[null,null,null,null,null,null,null,"Will a BREEAM AP be appointed before concept design stage & performance targets contractually agreed?",null,"No",null,1,null,{"$f":"IF(Man01_02=AIS_Yes,1,0)","v":0},null,"N/A"]
[null,null,null,null,null,null,null,"Will a BREEAM AP be appointed to monitor and report progress during feasibility & design stage?",null,"No",null,1,null,{"$f":"IF(AND(Man01_02=AIS_Yes,Man01_03=AIS_Yes),1,0)","v":0},null,"N/A",{"$f":"IF(AND(Man01_03=AIS_Yes,OR(Man01_02=AIS_No,Man01_02=\"\")),AIS_statement92,\"\")","v":""}]
[null,null,null,null,null,null,null,"BREEAM AP appointed to monitor & report progress during pre-construction to post-practical completion?",null,"No",null,1,null,{"$f":"IF(Man01_04=AIS_Yes,1,0)","v":0},null,"N/A"]
[null,null,null,null,null,null,null,"Will a thermographic survey or air leakage test be conducted and any defects uncovered remedied?",null,"No",null,{"$f":"IF(ADBT0=ADBT8,AIS_NA,1)","v":1},null,{"$f":"IF(ADBT0=ADBT8,AIS_NA,IF(AND(Man01_05=AIS_Yes,(OR(Man01_32=AIS_option05,Man01_32=AIS_option00))),Man01_14,IF(AND(Man01_05=AIS_Yes,Man01_32=AIS_option01),Man01_14,IF(AND(Man01_05=AIS_Yes,Man01_32=AIS_option02),Man01_14*0.5,IF(AND(Man01_05=AIS_Yes,Man01_32=AIS_option03),Man01_14,0)))))","v":0},null,"N/A"]
[null,null,null,null,null,null,null,"Will compliant commissioning of building services be carried out?",null,"No",null,1,null,{"$f":"IF(AND(Man01_06=AIS_Yes,(OR(Man01_33=AIS_option05,Man01_33=AIS_option00))),Man01_15,IF(AND(Man01_06=AIS_Yes,Man01_33=AIS_option01),Man01_15,IF(AND(Man01_06=AIS_Yes,Man01_33=AIS_option02),Man01_15*0.5,IF(AND(Man01_06=AIS_Yes,Man01_33=AIS_option03),Man01_15,0))))","v":0},null,"N/A"]
[null,null,null,null,null,null,null,"Will national best practice commissioning codes be followed?",null,"No",null,1,null,{"$f":"IF(AND(Man01_07=AIS_Yes, Man01_06=AIS_Yes,(OR(Man01_34=AIS_option05a,Man01_34=AIS_option00a))),Man01_16,IF(AND(Man01_07=AIS_Yes,Man01_34=AIS_option01a),Man01_16,IF(AND(Man01_07=AIS_Yes,Man01_34=AIS_option03a),Man01_16,0)))","v":0},null,"N/A",{"$f":"IF(AND(Man01_06=AIS_Yes,Man01_07=AIS_Yes),1,0)","v":0}]
[null,null,null,null,null,null,null,"Will compliant seasonal commissioning of building services be carried out?",null,"No",null,1,null,{"$f":"IF(AND(Man01_08=AIS_Yes,(OR(Man01_35=AIS_option05a,Man01_35=AIS_option00a))),Man01_17,IF(AND(Man01_08=AIS_Yes,Man01_07=AIS_Yes,Man01_35=AIS_option01a),Man01_17,IF(AND(Man01_08=AIS_Yes,Man01_07=AIS_Yes,Man01_35=AIS_option03a),Man01_17,0)))","v":0},null,"N/A",{"$f":"IF(AND(Man01_07=AIS_Yes,OR(Man01_06=AIS_No,Man01_06=\"\")),AIS_statement93,\"\")","v":""}]
[null,null,null,null,null,null,null,"Will water/energy consumption data be recorded and aftercare support provided for 12 months?",null,"No",null,1,null,{"$f":"IF(AND(Man01_08=AIS_Yes,Man01_40=AIS_Yes,(OR(Man01_35=AIS_option05a,Man01_35=AIS_option00a))),Man01_41,IF(AND(Man01_08=AIS_Yes,Man01_40=AIS_Yes,Man01_35=AIS_option01a),Man01_41,IF(AND(Man01_08=AIS_Yes,Man01_41=AIS_Yes,Man01_35=AIS_option03a),Man01_41,0)))","v":0},null,"N/A"]
[]
[null,null,null,null,null,null,null,"Exemplary level: Will occupant satisfaction, water/energy be recorded/reported for 3 yrs post construction?",null,"No",null,1,null,{"$f":"IF(AND(Man01_09=AIS_Yes,(OR(Man01_36=AIS_option05a,Man01_36=AIS_option00a))),Man01_18,IF(AND(Man01_09=AIS_Yes,Man01_36=AIS_option01a),Man01_18,IF(AND(Man01_09=AIS_Yes,Man01_36=AIS_option03a),Man01_18,0)))","v":0},null,"N/A"]
[null,null,null,null,null,null,null,null,null,null,null,null,null,null,null,null,{"$f":"IF(AND(Man01_08=AIS_Yes,J33=AIS_Yes),1,0)","v":0}]
[null,null,null,null,null,"Total BREEAM credits achieved",null,{"$f":"IF(ISERROR(Man01_Tot_Err), 0, Man01_Tot_Err)","v":0}]
[]
[null,null,null,null,null,"Total contribution to overall building score",null,{"$f":"IF(Score_option=_PSc2,(Man01_38/Man01_credits)*Man01_user,(Man01_38/Man01_credits)*Man01_Tot)","v":0}]
[]
[null,null,null,null,null,"Total BREEAM innovation credits achieved",null,{"$f":"N35","v":0}]
[]
[null,null,null,null,null,"Minimum standard(s) level",null,{"$f":"VLOOKUP(MinSt_01,AIS_MinSt_benchmarks,2,FALSE)","v":"Unclassified"}]
[]
[null,"Comments/notes:"]
[]
[null,"Man02 Responsible Construction Practices"]
[]
[null,null,null,null,null,"No. of BREEAM credits available",null,2,null,null,null,null,null,"Available contribution to overall score",null,{"$f":"(BP_32/BP_01)*Man02_credits","v":1.0434782608695651E-2}]
[]
[null,null,null,null,null,"No. of BREEAM innovation credits available",null,1,null,null,null,null,null,"Minimum standards applicable",null,"Yes"]
[]
[null,"Assessment Criteria"]
[null,null,null,null,null,null,null,null,null,null,null,null,null,null,null,"Shell & Core option?"]
[]
[null,null,null,null,null,null,null,"Which level of responsible construction practices will be achieved by the contractor?",null,"Please select"]
[]
[null,null,null,null,null,"Total BREEAM credits achieved",null,{"$f":"IF(ISERROR(Man02_Tot_Err), 0, Man02_Tot_Err)","v":0},null,null,null,null,null,null,null,"Shell & Core option?"]
[]
[null,null,null,null,null,"Total contribution to overall building score",null,{"$f":"IF(Score_option=_PSc2,(Man02_11/Man02_credits)*Man02_user,(Man02_11/Man02_credits)*Man02_Tot)","v":0}]
[]
[]
[null,null,null,null,null,"Total BREEAM innovation credits achieved",null,{"$f":"IF(Man02_14=Man02_ccs_option03,1,0)","v":0},null,null,null,null,null,null,null,"N/A"]
[]
[null,null,null,null,null,"Minimum standard(s) level",null,{"$f":"VLOOKUP(MinSt_02,AIS_MinSt_benchmarks,2,FALSE)","v":"Very Good"}]
[]
[null,"Comments/notes:"]
[]
[null,"Man03 Construction Site Impacts"]
[]
[null,null,null,null,null,"No. of BREEAM credits available",null,5,null,null,null,null,null,"Available contribution to overall score",null,{"$f":"(BP_32/BP_01)*Man03_credits","v":2.6086956521739129E-2}]
[]
[null,null,null,null,null,"No. of BREEAM innovation credits available",null,0,null,null,null,null,null,"Minimum standards applicable",null,"No"]
[null,"Assessment Criteria",null,null,null,null,null,null,null,"Compliant?",null,"Credits available",null,"Credits achieved",null,"Shell & Core option?"]
[]
[null,null,null,null,null,null,null,"Will site energy consumption be metered/monitored?",null,"No",null,1,null,{"$f":"IF(J76=AIS_Yes,Man03_06,0)","v":0},null,"N/A"]
[null,null,null,null,null,null,null,"Will site water consumption be metered/monitored?",null,"No",null,1,null,{"$f":"IF(J77=AIS_Yes,Man03_07,0)","v":0},null,"N/A"]
[null,null,null,null,null,null,null,"Will the transport of construction materials and waste to/from site be measured/monitored?",null,"No",null,1,null,{"$f":"IF(J78=AIS_Yes,Man03_08,0)","v":0},null,"N/A"]
[null,null,null,null,null,null,null,"Will all site timber be from legally harvested and legally traded sources?",null,"No",null,1,null,{"$f":"IF(J79=AIS_Yes,Man03_09,0)","v":0},null,"N/A"]
[null,null,null,null,null,null,null,"Will/does the principal contractor operate a compliant Environmental Management System?",null,"No",null,1,null,{"$f":"IF(Man03_05=AIS_No,0,IF(AND(Man03_05=AIS_Yes,Man03_11=AIS_Yes),Man03_10,0))","v":0},null,"N/A"]
[null,null,null,null,null,null,null,"Will the principal contractor adopt best practice pollution prevention policies & procedures?",null,"No"]
[null,"Key Performance Indicators: Construction site energy use"]
[]
[null,null,null,null,null,null,null,"Energy consumption (total) - site processes ",null,null,null,{"$f":"IF(AIS_stage00=AIS_stage01,AIS_statement01,IF(Man03_01=AIS_No,AIS_statement03,AIS_units01))","v":"Information not available at pre-assessment stage"}]
[null,null,null,null,null,null,null,"Energy consumption (intensity) - site processes ",null,null,null,{"$f":"IF(AIS_stage00=AIS_stage01,AIS_statement01,IF(Man03_01=AIS_No,AIS_statement03,AIS_units02))","v":"Information not available at pre-assessment stage"}]
[null,null,null,null,null,null,null,"Distance (total) - materials transport to site",null,null,null,{"$f":"IF(AIS_stage00=AIS_stage01,AIS_statement01,IF(Man03_03=AIS_No,AIS_statement03,AIS_units09))","v":"Information not available at pre-assessment stage"}]
[null,null,null,null,null,null,null,"Distance (total) -waste transport from site",null,null,null,{"$f":"IF(AIS_stage00=AIS_stage01,AIS_statement01,IF(Man03_03=AIS_No,AIS_statement03,AIS_units09))","v":"Information not available at pre-assessment stage"}]
[null,null,null,null,null,null,null,"Energy consumption (total) - materials transport to site",null,null,null,{"$f":"IF(AIS_stage00=AIS_stage01,AIS_statement01,IF(Man03_03=AIS_No,AIS_statement03,AIS_units08))","v":"Information not available at pre-assessment stage"}]
[null,null,null,null,null,null,null,"Energy consumption (total) - waste transport from site",null,null,null,{"$f":"IF(AIS_stage00=AIS_stage01,AIS_statement01,IF(Man03_03=AIS_No,AIS_statement03,AIS_units08))","v":"Information not available at pre-assessment stage"}]
[null,null,null,null,null,null,null,"Energy consumption (intensity) - materials transport to site ",null,null,null,{"$f":"IF(AIS_stage00=AIS_stage01,AIS_statement01,IF(Man03_03=AIS_No,AIS_statement03,AIS_units10))","v":"Information not available at pre-assessment stage"}]
[null,null,null,null,null,null,null,"Energy consumption (intensity) - waste transport from site ",null,null,null,{"$f":"IF(AIS_stage00=AIS_stage01,AIS_statement01,IF(Man03_03=AIS_No,AIS_statement03,AIS_units10))","v":"Information not available at pre-assessment stage"}]
[null,"Key Performance Indicators: Construction site greenhouse gas emissions"]
[]
[null,null,null,null,null,null,null,"Process greenhouse gas emissions (total) - site processes",null,null,null,{"$f":"IF(AIS_stage00=AIS_stage01,AIS_statement01,IF(Man03_01=AIS_No,AIS_statement03,AIS_units05))","v":"Information not available at pre-assessment stage"}]
[null,null,null,null,null,null,null," Greenhouse gas emissions (intensity) - site processes",null,null,null,{"$f":"IF(AIS_stage00=AIS_stage01,AIS_statement01,IF(Man03_01=AIS_No,AIS_statement03,AIS_units03))","v":"Information not available at pre-assessment stage"}]
[null,null,null,null,null,null,null,"Greenhouse gas emissions (total) - materials transport to site",null,null,null,{"$f":"IF(AIS_stage00=AIS_stage01,AIS_statement01,IF(Man03_03=AIS_No,AIS_statement03,AIS_units05))","v":"Information not available at pre-assessment stage"}]
[null,null,null,null,null,null,null,"Greenhouse gas emissions (total) - waste transport from site",null,null,null,{"$f":"IF(AIS_stage00=AIS_stage01,AIS_statement01,IF(Man03_03=AIS_No,AIS_statement03,AIS_units05))","v":"Information not available at pre-assessment stage"}]
[null,null,null,null,null,null,null,"Greenhouse gas emissions (intensity) - materials transport to site",null,null,null,{"$f":"IF(AIS_stage00=AIS_stage01,AIS_statement01,IF(Man03_03=AIS_No,AIS_statement03,AIS_units04))","v":"Information not available at pre-assessment stage"}]
[null,null,null,null,null,null,null,"Greenhouse gas emissions (intensity) - waste transport from site",null,null,null,{"$f":"IF(AIS_stage00=AIS_stage01,AIS_statement01,IF(Man03_03=AIS_No,AIS_statement03,AIS_units04))","v":"Information not available at pre-assessment stage"}]
[null,"Key Performance Indicators: Construction site use of freshwater resources"]
[]
[null,null,null,null,null,null,null,"Use of freshwater resource (total) - site processes",null,null,null,{"$f":"IF(AIS_stage00=AIS_stage01,AIS_statement01,IF(Man03_02=AIS_No,AIS_statement03,AIS_units07))","v":"Information not available at pre-assessment stage"}]
[null,null,null,null,null,null,null,"Use of freshwater resource (intensity) - site processes",null,null,null,{"$f":"IF(AIS_stage00=AIS_stage01,AIS_statement01,IF(Man03_02=AIS_No,AIS_statement03,AIS_units06))","v":"Information not available at pre-assessment stage"}]
[]
[null,null,null,null,null,"Total BREEAM credits achieved",null,{"$f":"IF(ISERROR(Man03_Tot_Err),0,Man03_Tot_Err)","v":0}]
[]
[null,null,null,null,null,"Total contribution to overall building score",null,{"$f":"IF(Score_option=_PSc2,(Man03_12/Man03_credits)*Man03_user, (Man03_12/Man03_credits)*Man03_Tot)","v":0}]
[]
[null,null,null,null,null,"Total BREEAM innovation credits achieved",null,"N/A"]
[]
[null,null,null,null,null,"Minimum standard(s) level",null,"N/A"]
[]
[null,"Comments/notes:"]
[]
[null,"Man04 Stakeholder Participation"]
[]
[null,null,null,null,null,"No. of BREEAM credits available",null,{"$f":"SUM(L122:L125)+SUM(L128:L131)","v":4},null,null,null,null,null,"Available contribution to overall score",null,{"$f":"(BP_32/BP_01)*Man04_credits","v":2.0869565217391303E-2}]
[]
[null,null,null,null,null,"No. of BREEAM innovation credits available",null,0,null,null,null,null,null,"Minimum standards applicable",null,"Yes"]
[null,"04a   -  Assessment Criteria  - Non Residential",null,null,null,null,null,null,null,"Compliant?",null,"Credits available",null,"Credits achieved",null,"Shell & Core option?"]
[]
[null,null,null,null,null,null,null,"Will an appropriate level of consultation activities be undertaken?",null,"No",null,{"$f":"IF(ADBT0=ADBT8,0,1)","v":1},null,{"$f":"IF(ADBT0=ADBT8,0,IF(Man04_01=AIS_Yes,Man04_05,0))","v":0},null,"N/A"]
[null,null,null,null,null,null,null,"Will an access statement be developed and appropriate building user facilities provided?",null,"No",null,{"$f":"IF(ADBT0=ADBT8,0,1)","v":1},null,{"$f":"IF(ADBT0=ADBT8,0,IF(Man04_02=AIS_Yes,Man04_05,0))","v":0},null,"N/A"]
[null,null,null,null,null,null,null,"Will building user guides and relevant user information be provided?",null,"No",null,{"$f":"IF(ADBT0=ADBT8,0,1)","v":1},null,{"$f":"IF(AND((J124=AIS_Yes),(P124=\"Option 2: N/A\")),0,IF(AND((J124=AIS_Yes),(P124=\"Option 1\")),1,IF(AND((J124=AIS_Yes),(P124=\"Option 3\")),1,IF(AND((J124=AIS_Yes),(P124=\"N/A\")),1,0))))","v":0},null,"N/A",{"$f":"IF(Man04_03=AIS_No,AIS_statement04,\"\")","v":"Note: Compliance with the criteria and award of this credit is a minimum standard for achieving the BREEAM Good rating and above."}]
[null,null,null,null,null,null,null,"Will a post occupancy evaluation assessment be undertaken and information disseminated?",null,"No",null,{"$f":"IF(ADBT0=ADBT8,0,1)","v":1},null,{"$f":"IF(AND((J125=AIS_Yes),(P125=\"Option 2: N/A\")),0,IF(AND((J125=AIS_Yes),(P125=\"Option 1\")),1,IF(AND((J125=AIS_Yes),(P125=\"Option 3\")),1,IF(AND((J125=AIS_Yes),(P125=\"N/A\")),1,0))))","v":0},null,"N/A"]
[]
[null,"04b   -  Assessment Criteria  - Residential",null,null,null,null,null,null,null,"Compliant?",null,"Credits available",null,"Credits achieved"]
[null,null,null,null,null,null,null,"Will an access statement be developed and appropriate building user facilities provided?",null,"No",null,{"$f":"IF(ADBT0<>ADBT8,0,2)","v":0},null,{"$f":"IF(ADBT0<>ADBT8,0,IF(Man04_02b=AIS_Yes,2,0))","v":0}]
[null,null,null,null,null,null,null,"Will a Home User Guide compliant to Part 1 (operational issues) of Checklist A3 be provided?",null,"No",null,{"$f":"IF(ADBT0<>ADBT8,0,1)","v":0},{"$f":"IF(AND(Hea05_02=AIS_Yes,Hea05_06=\"\"),\"→\",\"\")","v":""},{"$f":"IF(ADBT0<>ADBT8,0,IF(Man04_03b=AIS_Yes,1,0))","v":0},{"$f":"IF(AND(Hea05_02=AIS_Yes,Hea05_06=\"\"),\"←\",\"\")","v":""},null,{"$f":"IF(Man04_03b=AIS_No,AIS_statement04,\"\")","v":"Note: Compliance with the criteria and award of this credit is a minimum standard for achieving the BREEAM Good rating and above."}]
[null,null,null,null,null,null,null,"Will a Home User Guide compliant to Part 1 and Part 2 (site and surroundings) of Checklist A3 be provided?",null,"No",null,{"$f":"IF(ADBT0<>ADBT8,0,1)","v":0},null,{"$f":"IF(OR(ADBT0<>ADBT8,Man04_03b=AIS_No),0,IF(Man04_03b2=AIS_Yes,1,0))","v":0}]
[null,null,null,null,null,null,null,"Will a post occupancy evaluation assessment be undertaken and information disseminated?",null,"No",null,{"$f":"IF(ADBT0<>ADBT8,0,1)","v":0},null,{"$f":"IF(ADBT0<>ADBT8,0,IF(Man04_04b=AIS_Yes,1,0))","v":0}]
[]
[]
[null,null,null,null,null,"Total BREEAM credits achieved",null,{"$f":"IF(ISERROR(Man04_Tot_Err),0,Man04_Tot_Err)","v":0}]
[]
[null,null,null,null,null,"Total contribution to overall building score",null,{"$f":"IF(Score_option=_PSc2,(Man04_17/Man04_credits)*Man04_user,(Man04_17/Man04_credits)*Man04_tot)","v":0}]
[]
[null,null,null,null,null,"Total BREEAM innovation credits achieved",null,"N/A"]
[]
[null,null,null,null,null,"Minimum standard(s) level",null,{"$f":"IF(ADBT0=ADBT8,VLOOKUP(MinSt_04,AIS_MinSt_benchmarks,2,FALSE),VLOOKUP(MinSt_03,AIS_MinSt_benchmarks,2,FALSE))","v":"Pass"}]
[]
[null,"Comments/notes:"]
[]
[null,"Man05 Life cycle cost and service life planning"]
[]
[null,null,null,null,null,"No. of BREEAM credits available",null,3,null,null,null,null,null,"Available contribution to overall score",null,{"$f":"(BP_32/BP_01)*Man05_credits","v":1.5652173913043476E-2}]
[]
[null,null,null,null,null,"No. of BREEAM innovation credits available",null,0,null,null,null,null,null,"Minimum standards applicable",null,"No"]
[null,"Assessment Criteria",null,null,null,null,null,null,null,"Compliant?",null,"Credits available",null,"Credits achieved",null,"Shell & Core option?"]
[]
[null,null,null,null,null,null,null,"Will a feasibility stage Life Cycle Cost (LCC) analysis be commissioned and completed?",null,"No",null,1,null,{"$f":"IF(Man05_01=AIS_Yes,Man05_04,0)","v":0},null,"N/A"]
[null,null,null,null,null,null,null,"Will a strategic and system level LCC be commissioned and completed?",null,"No",null,1,null,{"$f":"IF(AND(Man05_02=AIS_Yes,Man05_01=AIS_Yes),Man05_05,0)","v":0},null,"N/A",{"$f":"IF(AND(Man05_02=AIS_Yes,Man05_01=AIS_No),AIS_statement94,\"\")","v":""}]
[null,null,null,null,null,null,null,"Will a technical design LCC to be commissioned and completed?",null,"No",null,1,null,{"$f":"IF(AND(Man05_02=AIS_Yes,Man05_01=AIS_Yes,Man05_03=AIS_Yes),Man05_06,0)","v":0},null,"N/A",{"$f":"IF(AND(Man05_03=AIS_Yes,OR(Man05_01=AIS_No,Man05_02=AIS_No)),AIS_Statement95,\"\")","v":""}]
[]
[null,null,null,null,null,"Total BREEAM credits achieved",null,{"$f":"IF(ISERROR(Man05_Tot_Err),0,Man05_Tot_Err)","v":0}]
[]
[null,null,null,null,null,"Total contribution to overall building score",null,{"$f":"IF(Score_option=_PSc2,(Man05_10/Man05_credits)*Man05_user,(Man05_10/Man05_credits)*Man05_tot)","v":0}]
[]
[null,null,null,null,null,"Total BREEAM innovation credits achieved",null,"N/A"]
[]
[null,null,null,null,null,"Minimum standard(s) level",null,"N/A"]
[]
[null,"Comments/notes:"]
[]
[]
[null,"HEALTH & WELLBEING"]
[]
[null,"Hea01 Visual Comfort"]
[]
[null,null,null,null,null,"No. of BREEAM credits available",null,{"$f":"SUM(L175:L178)","v":3},null,null,null,null,null,"Available contribution to overall score",null,{"$f":"(BP_33/BP_02)*Hea01_credits","v":3.2307692307692315E-2}]
[]
[null,null,null,null,null,"No. of BREEAM innovation credits available",null,{"$f":"AIS_NA","v":"N/A"},null,null,null,null,null,"Minimum standards applicable",null,"Yes"]
[null,"Assessment Criteria",null,null,null,null,null,null,null,"Compliant?",null,"Credits available",null,"Credits achieved",null,"Shell & Core  option?"]
[]
[null,null,null,null,null,null,null,"Will all fluorescent lamps be fitted with high frequency ballasts?",null,"No",null,"N/A",null,"N/A",null,"N/A",{"$f":"IF(Hea01_01=AIS_No,AIS_statement19,\"\")","v":"Note: Compliance with this item is a minimum standard for achieving any BREEAM rating level (it is not necessary to achieve the credit to comply with the minimum standards)."}]
[null,null,null,null,null,null,null,"Will all relevant building areas be designed to achieve the appropriate daylight criteria?",null,"No",null,{"$f":"IF(ADBT0=ADBT3,AIS_credit02,IF(ADBT0=ADBT8,AS1388,AS1385))","v":1},{"$f":"IF(AND(Hea01_02=AIS_Yes,Hea01_13=\"\"),\"→\",\"\")","v":""},null,{"$f":"IF(AND(Hea01_02=AIS_Yes,Hea01_13=\"\"),\"←\",\"\")","v":""},"N/A",{"$f":"IF((AND(Hea01_02=AIS_No,Hea01_13>0)),AIS_statement08,IF(Hea01_13>Hea01_07,AIS_statement74,IF(AND(Hea01_02=AIS_Yes,Hea01_13=\"\"),AIS_statement84,\"\")))","v":""}]
[null,null,null,null,null,null,null,"Will the design provide adequate glare control and view out for building users?",null,"No",null,{"$f":"IF(ADBT0=ADBT8,AS1384,AS1385)","v":1},null,{"$f":"IF(AND(Hea01_03=AIS_Yes,(OR(Hea01_20=AIS_option05,Hea01_20=AIS_option00))),Hea01_08,IF(AND(Hea01_03=AIS_Yes,Hea01_20=AIS_option01),Hea01_08,IF(AND(Hea01_03=AIS_Yes,Hea01_20=AIS_option02),Hea01_08*0.5,IF(AND(Hea01_03=AIS_Yes,Hea01_20=AIS_option03),Hea01_08,0))))","v":0},null,"N/A",{"$f":"IF(Hea01_20=\"N/A\",\"\",\"Note: The shell and core options are only applicable to the glare control criteria.\")","v":""}]
[null,null,null,null,null,null,null,"Will internal/external lighting be specified in accordance with the relevant best practice standards?",null,"No",null,{"$f":"IF(ADBT0=ADBT8,AS1384,AS1385)","v":1},null,{"$f":"IF(AND((J178=AIS_Yes),(P178=\"Option 2\")),0.5*Hea01_09,IF(AND((J178=AIS_Yes),(P178=\"Option 1\")),Hea01_09,IF(AND((J178=AIS_Yes),(P178=\"Option 3\")),Hea01_09,IF(AND((J178=AIS_Yes),(P178=\"N/A\")),Hea01_09,0))))","v":0},null,"N/A"]
[]
[]
[null,null,null,null,null,"Total BREEAM credits achieved",null,{"$f":"IF(ISERROR(Hea01_Tot_Err), 0, Hea01_Tot_Err)","v":0}]
[]
[null,null,null,null,null,"Total contribution to overall building score",null,{"$f":"IF(Score_option=_PSc2,(Hea01_26/Hea01_credits)*Hea01_user,(Hea01_26/Hea01_credits)*Hea01_tot)","v":0}]
[]
[null,null,null,null,null,"Total BREEAM innovation credits achieved",null,{"$f":"AIS_NA","v":"N/A"}]
[]
[null,null,null,null,null,"Minimum standard(s) level",null,{"$f":"VLOOKUP(MinSt_05,AIS_MinSt_benchmarks,2,FALSE)","v":"Unclassified"}]
[]
[null,"Comments/notes:"]
[]
[null,"Hea02 Indoor Air Quality",null,null,null,null,null,null,null,null,null,null,null,null,null,{"$f":"IF(Hea02_credits=AIS_NA,AIS_statement32,\"\")","v":""}]
[null,null,null,null,null,null,null,{"$f":"IF(Hea02_credits=AIS_NA,0,Hea02_credits)","v":4}]
[null,null,null,null,null,"No. of BREEAM credits available",null,{"$f":"IF(SUM(L199:L206)=0,AIS_NA,SUM(L199:L206))","v":4},null,null,null,null,null,"Available contribution to overall score",null,{"$f":"IF(Hea02_credits=AIS_NA,AIS_NA,(BP_33/BP_02)*Hea02_credits)","v":4.3076923076923082E-2},{"$f":"IF(AND(ADBT0=ADBT2,ADIND_option03=AD_no,ADFume_option01=AD_no,(OR(AD_catlevel=AD_catlevel01,AD_catlevel=AD_nolab))),AIS_statement16,\"\")","v":""}]
[]
[null,null,null,null,null,"No. of BREEAM innovation credits available",null,{"$f":"IF(Hea02_credits=AIS_NA,AIS_NA,2)","v":2},null,null,null,null,null,"Minimum standards applicable",null,{"$f":"IF(Hea02_credits=AIS_NA,AIS_NA,AIS_Yes)","v":"Yes"}]
[null,"Assessment Criteria",null,null,null,null,null,null,null,"Compliant?",null,"Credits available",null,"Credits achieved",null,"Shell & Core option?"]
[]
[null,null,null,null,null,null,null,"Will asbestos containing materials be prohibited from use within the building?",null,"No",null,"N/A",null,"N/A",null,"N/A",{"$f":"IF(Hea02_00=AIS_No,AIS_statement19,\"\")","v":"Note: Compliance with this item is a minimum standard for achieving any BREEAM rating level (it is not necessary to achieve the credit to comply with the minimum standards)."}]
[null,null,null,null,null,null,null,"Will an air quality plan be produced?",null,"No",null,{"$f":"IF(AND(ADIND_option03=AD_no,ADBT0=ADBT2),AIS_option05,AS1385)","v":1},null,{"$f":"IF(Hea02_00=AIS_No,0,(IF(AND(ADIND_option03=AD_no,ADBT0=ADBT2),AIS_option05,IF(AND(Hea02_01=AIS_Yes,Hea02_28=AIS_Yes),Hea02_07,AS1384))))","v":0},null,"N/A"]
[null,null,null,null,null,null,null,"Will the building be designed to minimise sources of internal and external air pollution?",null,"No",null,null,null,null,null,null,{"$f":"IF(Hea02_27=AIS_statement32,\"\",IF((AND(ADIND_option03=AD_no,ADBT0=ADBT2)),AIS_statement15,\"\"))","v":""}]
[null,null,null,null,null,null,null,"Will the relevant products be specified to meet the VOC testing and emission levels required?",null,"No",null,{"$f":"IF(AND(ADIND_option03=AD_no,ADBT0=ADBT2),AIS_option05,AS1385)","v":1},null,{"$f":"IF(Hea02_00=AIS_No,0,(IF(AND(ADIND_option03=AD_no,ADBT0=ADBT2),AIS_option05,IF(AND(Hea02_02=AIS_Yes,Hea02_01=AIS_Yes,(OR(Hea02_20=AIS_option05,Hea02_20=AIS_option00))),Hea02_08,IF(AND(Hea02_02=AIS_Yes,Hea02_01=AIS_Yes,Hea02_20=AIS_option01),Hea02_08,IF(AND(Hea02_02=AIS_Yes,Hea02_01=AIS_Yes,Hea02_20=AIS_option02),Hea02_08*0.5,IF(AND(Hea02_02=AIS_Yes,Hea02_01=AIS_Yes,Hea02_20=AIS_option03),Hea02_08,0)))))))","v":0},null,"N/A",{"$f":"IF(Hea02_27=AIS_statement32,\"\",IF(AND(ADIND_option03=AD_no,ADBT0=ADBT2),AIS_statement15,IF(AND(Hea02_01=AIS_No,Hea02_02=AIS_Yes),AIS_statement97,\"\")))","v":""}]
[null,null,null,null,null,null,null,"Will formaldehyde and total VOC levels be measured post construction?",null,"No",null,{"$f":"IF(AND(ADIND_option03=AD_no,ADBT0=ADBT2),AIS_option05,AS1385)","v":1},null,{"$f":"IF(Hea02_00=AIS_No,0,(IF(AND(ADIND_option03=AD_no,ADBT0=ADBT2),AIS_option05,IF(AND(Hea02_03=AIS_Yes,Hea02_01=AIS_Yes,(OR(Hea02_21=AIS_option05,Hea02_21=AIS_option00))),Hea02_09,IF(AND(Hea02_03=AIS_Yes,Hea02_01=AIS_Yes,Hea02_21=AIS_option01),Hea02_09,IF(AND(Hea02_03=AIS_Yes,Hea02_01=AIS_Yes,Hea02_21=AIS_option02),Hea02_09*0.5,IF(AND(Hea02_03=AIS_Yes,Hea02_01=AIS_Yes,Hea02_21=AIS_option03),Hea02_09,0)))))))","v":0},null,"N/A",{"$f":"IF(Hea02_27=AIS_statement32,\"\",IF(AND(ADIND_option03=AD_no,ADBT0=ADBT2),AIS_statement15,IF(AND(Hea02_01=AIS_No,Hea02_03=AIS_Yes),AIS_statement97,\"\")))","v":""}]
[null,null,null,null,null,null,null,"Will the building be designed to, or have the potential to provide, natural ventilation?",null,"No",null,{"$f":"IF(AND(ADIND_option03=AD_no,ADBT0=ADBT2),AIS_NA,1)","v":1},null,{"$f":"IF(AND(ADIND_option03=AD_no,ADBT0=ADBT2),AIS_NA,IF(Hea02_04=AIS_Yes,Hea02_10,0))","v":0},null,"N/A",{"$f":"IF(Hea02_27=AIS_statement32,\"\",IF(AND(ADIND_option03=AD_no,ADBT0=ADBT2),AIS_statement15,\"\"))","v":""},null,"FC+CL available","FC+CL ach."]
[null,null,null,null,null,null,null,"Fume cupboards (manufacture and installation)",null,"No",null,"N/A",null,"N/A",null,"N/A",null,null,{"$f":"IF(ADFume_option01=AD_Yes,1,AIS_NA)","v":"N/A"},{"$f":"IF(Hea02_00=AIS_No,0,(IF(ADFume_option01=AD_no,AIS_NA,IF(Hea02_05=AIS_Yes,Hea02_11,0))))","v":0}]
[]
[null,null,null,null,null,null,null,"Containment Level 2 and 3 labs (ventilation, pollution and safety) ",null,"No",null,"N/A",null,"N/A",null,"N/A",null,null,{"$f":"IF(OR(AD_catlevel=AD_catlevel02,AD_catlevel=AD_catlevel03),1,AIS_NA)","v":"N/A"},{"$f":"IF(OR(AD_catlevel=AD_catlevel02,AD_catlevel=AD_catlevel03),IF(Hea02_06=AIS_Yes,Hea02_12,0),AIS_NA)","v":"N/A"}]
[]
[null,null,null,null,null,null,null,"Exemplary level - will the VOC emission levels of the specified products fall below 60μg/m3?",null,"No",null,1,null,{"$f":"IF(AND(Hea02_Ex01=AIS_Yes,Hea02_02=AIS_Yes,Hea02_03=AIS_Yes),Hea02_Ex03,0)","v":0},null,"N/A"]
[null,null,null,null,null,null,null,"Exemplary level - will the VOC emission levels of the specified products fall below 10μg/m3?",null,"No",null,1,null,{"$f":"IF(AND(Hea02_Ex02=AIS_Yes,Hea02_02=AIS_Yes,Hea02_03=AIS_Yes),Hea02_Ex04,0)","v":0},null,"N/A"]
[null,"Key Performance Indicators: Indoor air quality"]
[]
[null,null,null,null,null,null,null,"Concentration levels of formaldehyde",null,null,null,{"$f":"IF(P191=AIS_statement32,\"\",IF(AIS_stage00=AIS_stage01,AIS_statement01,IF(Hea02_03=AIS_No,AIS_statement03,AIS_units11)))","v":"Information not available at pre-assessment stage"}]
[null,null,null,null,null,null,null,"Total volatile organic compound (TVOC) concentration ",null,null,null,{"$f":"IF(P191=AIS_statement32,\"\",IF(AIS_stage00=AIS_stage01,AIS_statement01,IF(Hea02_03=AIS_No,AIS_statement03,AIS_units11)))","v":"Information not available at pre-assessment stage"}]
[]
[null,null,null,null,null,"Total BREEAM credits achieved",null,{"$f":"IF(ISERROR(Hea02_Tot_Err), 0, Hea02_Tot_Err)","v":0}]
[]
[null,null,null,null,null,"Total contribution to overall building score",null,{"$f":"IF(Hea02_27=AIS_statement32,AIS_NA,IF(Score_option=_PSc2,(Hea02_25/Hea02_credits)*Hea02_user,(Hea02_25/Hea02_credits)*Hea02_tot))","v":0}]
[]
[null,null,null,null,null,"Total BREEAM innovation credits achieved",null,{"$f":"N208+N209","v":0}]
[]
[null,null,null,null,null,"Minimum standard(s) level",null,{"$f":"VLOOKUP(MinSt_15,AIS_MinSt_benchmarks,2,FALSE)","v":"Unclassified"}]
[]
[null,"Comments/notes:"]
[]
[null,"Hea03 Thermal Comfort",null,null,null,null,null,null,null,null,null,null,null,null,null,{"$f":"IF(AND(ADBT0=ADBT2,ADIND_option03=AD_no),AIS_statement32,\"\")","v":""}]
[null,null,null,null,null,null,null,{"$f":"IF(Hea03_credits=AIS_NA,0,Hea03_credits)","v":2}]
[null,null,null,null,null,"No. of BREEAM credits available",null,{"$f":"IF(Hea03_13=AIS_statement32,AIS_NA,2)","v":2},null,null,null,null,null,"Available contribution to overall score",null,{"$f":"IF(Hea03_13=AIS_statement32,AIS_NA,(BP_33/BP_02)*Hea03_credits)","v":2.1538461538461541E-2},{"$f":"IF(AND(ADBT0=ADBT2,ADIND_option03=AD_no),AIS_statement18,\"\")","v":""}]
[]
[null,null,null,null,null,"No. of BREEAM innovation credits available",null,{"$f":"IF(Hea03_13=AIS_statement32,AIS_NA,0)","v":0},null,null,null,null,null,"Minimum standards applicable",null,{"$f":"IF(Hea03_13=AIS_statement32,AIS_NA,AIS_No)","v":"No"}]
[null,"Assessment Criteria",null,null,null,null,null,null,null,"Compliant?",null,"Credits available",null,"Credits achieved",null,"Shell & Core option?"]
[]
[null,null,null,null,null,null,null,"Will thermal modelling of the design be carried out?",null,"No",null,{"$f":"IF(AND(ADIND_option03=AD_no,ADBT0=ADBT2),AIS_NA,1)","v":1},null,{"$f":"IF(Hea03_03=AIS_NA,AIS_NA,IF(AND((Hea03_01=AIS_Yes),(Hea03_07=\"Option 2\")),0.5,IF(AND((Hea03_01=AIS_Yes),(Hea03_07=\"Option 1\")),1,IF(AND((Hea03_01=AIS_Yes),(Hea03_07=\"Option 3\")),1,IF(AND((Hea03_01=AIS_Yes),(Hea03_07=\"N/A\")),1,0)))))","v":0},null,"N/A"]
[null,null,null,null,null,null,null,"Will the modelling inform the development of a thermal zoning and control strategy?",null,"No",null,{"$f":"IF(AND(ADIND_option03=AD_no,ADBT0=ADBT2),AIS_NA,1)","v":1},null,{"$f":"IF(Hea03_04=AIS_NA,AIS_NA,IF(Hea03_01=AIS_No,0,IF(AND(Hea03_02=AIS_Yes,Hea03_08=\"Option 1\"),1,IF(AND(Hea03_02=AIS_Yes,Hea03_08=\"Option 2\"),0.5,IF(AND(Hea03_02=AIS_Yes,Hea03_08=\"Option 3\"),1,IF(AND(Hea03_02=AIS_Yes,Hea03_08=\"N/A\"),1,0))))))","v":0},null,"N/A",{"$f":"IF(AND(Hea03_02=AIS_Yes,Hea03_01=AIS_No),AIS_statement96,\"\")","v":""}]
[null,"Key Performance Indicators: Thermal comfort (PPD and PMV)"]
[]
[null,null,null,null,null,null,null,"Predicted percentage dissatisfied (PPD)"]
[null,null,null,null,null,null,null,"Predicted mean vote (PMV)"]
[]
[null,null,null,null,null,"Total BREEAM credits achieved",null,{"$f":"IF(ISERROR(Hea03_Tot_Err), 0, Hea03_Tot_Err)","v":0}]
[]
[null,null,null,null,null,"Total contribution to overall building score",null,{"$f":"IF(Hea03_13=AIS_statement32,AIS_NA,IF(Score_option=_PSc2,(Hea03_09/Hea03_credits)*Hea03_user,(Hea03_09/Hea03_credits)*Hea03_tot))","v":0}]
[]
[null,null,null,null,null,"Total BREEAM innovation credits achieved",null,"N/A"]
[]
[null,null,null,null,null,"Minimum standard(s) level",null,"N/A"]
[]
[null,"Comments/notes:"]
[]
[null,"Hea04 Water Quality"]
[]
[null,null,null,null,null,"No. of BREEAM credits available",null,1,null,null,null,null,null,"Available contribution to overall score",null,{"$f":"(BP_33/BP_02)*Hea04_credits","v":1.0769230769230771E-2}]
[]
[null,null,null,null,null,"No. of BREEAM innovation credits available",null,0,null,null,null,null,null,"Minimum standards applicable",null,"Yes"]
[null,"Assessment Criteria",null,null,null,null,null,null,null,"Compliant?",null,"Credits available",null,"Credits achieved",null,"Shell & Core option?"]
[]
[null,null,null,null,null,null,null,"Will water systems comply with relevant best practice standards for microbial contamination?",null,"No",null,1,null,{"$f":"IF(AND(ADBT0=ADBT8,Hea04_01=AIS_Yes,OR(Hea04_02=AIS_Yes,Hea04_02=AIS_NA)),1,IF(AND(Hea04_01=AIS_Yes,(OR(Hea04_02=AIS_Yes,Hea04_02=AIS_NA)),Hea04_03=AIS_Yes,(Hea04_14=AIS_Yes)),Hea04_04,IF(AND(Hea04_01=AIS_Yes,(OR(Hea04_02=AIS_Yes,Hea04_02=AIS_NA)),Hea04_03=AIS_Yes,Hea04_14=AIS_option02),Hea04_04*0.5,0)))","v":0},null,"N/A",{"$f":"IF(Hea04_01=AIS_No,AIS_statement19,\"\")","v":"Note: Compliance with this item is a minimum standard for achieving any BREEAM rating level (it is not necessary to achieve the credit to comply with the minimum standards)."}]
[null,null,null,null,null,null,null,"Where humidification is to be provided, will a failsafe humidification system be specified?",null,"No",null,null,null,null,null,"N/A"]
[null,null,null,null,null,null,null,"Will a wholesome supply of accessible, clean and fresh drinking water be supplied for building users?",null,"No",null,null,null,null,null,"N/A",{"$f":"IF(OR(ADPT=ADPT02,ADPT=ADPT04),IF(OR(Hea04_06=AIS_option02,Hea04_07=AIS_option02,Hea04_08=AIS_option02),AIS_statement79,\"\"),\"\")","v":""}]
[]
[null,null,null,null,null,"Total BREEAM credits achieved",null,{"$f":"IF(ISERROR(N256), 0, N256)","v":0}]
[]
[null,null,null,null,null,"Total contribution to overall building score",null,{"$f":"IF(Score_option=_PSc2,(Hea04_12/Hea04_credits)*Hea04_user,(Hea04_12/Hea04_credits)*Hea04_tot)","v":0}]
[]
[null,null,null,null,null,"Total BREEAM innovation credits achieved",null,"N/A"]
[]
[null,null,null,null,null,"Minimum standard(s) level",null,{"$f":"VLOOKUP(MinSt_06,AIS_MinSt_benchmarks,2,FALSE)","v":"Unclassified"}]
[]
[null,"Comments/notes:"]
[]
[null,"Hea05 Acoustic Performance"]
[]
[null,null,null,null,null,"No. of BREEAM credits available",null,{"$f":"IF(ADBT0=ADBT8,4,IF(ADBT0<>ADBT8,2,0))","v":2},null,null,null,null,null,"Available contribution to overall score",null,{"$f":"(BP_33/BP_02)*Hea05_credits","v":2.1538461538461541E-2}]
[]
[null,null,null,null,null,"No. of BREEAM innovation credits available",null,0,null,null,null,null,null,"Minimum standards applicable",null,"No"]
[]
[null,null,null,null,null,null,null,"Will a suitably qualified acoustician be appointed to provide appropriate design advice?",null,"No"]
[]
[null," 05a  -  Assessment Criteria  - Non Residential",null,null,null,null,null,null,null,"Compliant?",null,"Credits available",null,"Credits achieved",null,"Shell & Core option?"]
[null,null,null,null,null,null,null,"Will the building meet the relevant ambient noise & sound insulation requirements?",null,"No",null,{"$f":"IF(ADBT0<>ADBT8,1,0)","v":1},null,{"$f":"IF(AND(ADBT0<>ADBT8,Hea05_PreReq=AIS_Yes,Hea05_01=AIS_Yes),1,0)","v":0},null,"N/A"]
[null,null,null,null,null,null,null,"Will the building meet the relevant reverberation times?",null,"No",null,{"$f":"IF(ADBT0<>ADBT8,1,0)","v":1},null,{"$f":"IF(AND(ADBT0<>ADBT8,Hea05_PreReq=AIS_Yes,Hea05_02=AIS_Yes),1,0)","v":0},null,"N/A",{"$f":"IF(AND(Hea05_02=AIS_Yes,Hea05_06=\"\"),AIS_statement84,\"\")","v":""}]
[]
[]
[null," 05b  -  Assessment Criteria  - Residential",null,null,null,null,null,null,null,"Compliant?",null,"Credits available",null,"Credits achieved"]
[null,null,null,null,null,null,null,"Will the building meet the relevant ambient noise & sound insulation requirements?",null,"Yes",null,{"$f":"IF(AND(ADBT0=ADBT8,Hea05_PreReq=AIS_Yes),4,0)","v":0},"→",0,null,null,{"$f":"IF(AND(Hea05_01b=AIS_Yes,Hea05_PreReq=AIS_Yes,N284=\"\"),\"Enter Credits achieved.\",\"\")","v":""}]
[]
[]
[]
[null,null,null,null,null,"Total BREEAM credits achieved",null,{"$f":"IF(ISERROR(Hea05_Tot_Err), 0, Hea05_Tot_Err)","v":0}]
[]
[null,null,null,null,null,"Total contribution to overall building score",null,{"$f":"IF(Score_option=_PSc2,(Hea05_07/Hea05_credits)*Hea05_user,(Hea05_07/Hea05_credits)*Hea05_tot)","v":0}]
[]
[null,null,null,null,null,"Total BREEAM innovation credits achieved",null,"N/A"]
[]
[null,null,null,null,null,"Minimum standard(s) level",null,"N/A"]
[]
[null,"Comments/notes:"]
[]
[null,"Hea06 Safe Access"]
[null,null,null,null,null,null,null,{"$f":"IF(Hea06_credits=AIS_NA,0,Hea06_credits)","v":1}]
[null,null,null,null,null,"No. of BREEAM credits available",null,{"$f":"IF(AD_SiteAccess=AD_no,AIS_NA,1)","v":1},null,null,null,null,null,"Available contribution to overall score",null,{"$f":"IF(Hea06_credits=AIS_NA,0,(BP_33/BP_02)*Hea03_credits)","v":2.1538461538461541E-2}]
[]
[null,null,null,null,null,"No. of BREEAM innovation credits available",null,0,null,null,null,null,null,"Minimum standards applicable",null,"No"]
[null,"Assessment Criteria",null,null,null,null,null,null,null,"Compliant?",null,"Credits available",null,"Credits achieved",null,"Shell & Core option?",{"$f":"IF(Hea06_credits=AIS_NA,AIS_statement20,\"\")","v":""}]
[]
[null,null,null,null,null,null,null,"Where external site areas are present, will safe access be designed for pedestrians and cyclists?",null,"No",null,{"$f":"IF(Hea06_01=AIS_NA,AIS_NA,AS1385)","v":1},null,{"$f":"IF(Hea06_01=AIS_Yes,Hea06_03,IF(Hea06_01=AIS_NA,AIS_NA,0))","v":0},null,"N/A",{"$f":"IF(Hea06_01=AIS_NA,AIS_statement20,\"\")","v":""}]
[]
[null,null,null,null,null,"Total BREEAM credits achieved",null,{"$f":"IF(ISERROR(Hea06_Tot_Err), 0, Hea06_Tot_Err)","v":0}]
[]
[null,null,null,null,null,"Total contribution to overall building score",null,{"$f":"IF(Hea06_credits=AIS_NA,\"0.00%\",IF(Score_option=_PSc2,(Hea06_07/Hea06_credits)*Hea06_user,(Hea06_07/Hea06_credits)*Hea06_tot))","v":0}]
[]
[null,null,null,null,null,"Total BREEAM innovation credits achieved",null,"N/A"]
[]
[null,null,null,null,null,"Minimum standard(s) level",null,"N/A"]
[]
[null,"Comments/notes:"]
[]
[]
[null,"Hea07 Hazards"]
[]
[null,null,null,null,null,"No. of BREEAM credits available",null,{"$f":"IF(AD_NaturalHazards=AD_no,AIS_NA,1)","v":1},null,null,null,null,null,"Available contribution to overall score",null,{"$f":"IF(Hea07_Credits=AIS_NA,0,(BP_33c/BP_02c)*Hea07_Credits)","v":0.01}]
[]
[null,null,null,null,null,"No. of BREEAM innovation credits available",null,0,null,null,null,null,null,"Minimum standards applicable",null,"No"]
[null,"Assessment Criteria",null,null,null,null,null,null,null,"Compliant?",null,"Credits available",null,"Credits achieved",null,"Shell & Core option?",{"$f":"IF(Hea07_Credits=AIS_NA,AIS_statement20b,\"\")","v":""}]
[]
[null,null,null,null,null,null,null,"Will a risk assessment and appropriate mitigation be carried out for natural hazards?",null,"No",null,{"$f":"IF(Hea07_01=AIS_NA,AIS_NA,AS1385)","v":1},null,{"$f":"IF(Hea07_01=AIS_Yes,Hea07_03,IF(Hea07_01=AIS_NA,AIS_NA,0))","v":0},null,"N/A"]
[]
[null,null,null,null,null,"Total BREEAM credits achieved",null,{"$f":"IF(ISERROR(Hea07_Tot_Err), 0, Hea07_Tot_Err)","v":0}]
[]
[null,null,null,null,null,"Total contribution to overall building score",null,{"$f":"IF(Hea07_Credits=AIS_NA,\"0.00%\",IF(Score_option=_PSc2,(Hea07_07/Hea07_Credits)*Hea07_user,(Hea07_07/Hea07_Credits)*Hea07_Tot))","v":0}]
[]
[null,null,null,null,null,"Total BREEAM innovation credits achieved",null,"N/A"]
[]
[null,null,null,null,null,"Minimum standard(s) level",null,"N/A"]
[]
[null,"Comments/notes:"]
[]
[]
[null,"Hea08 Private Space"]
[null,null,null,null,null,null,null,{"$f":"IF(Hea08_Credits=AIS_NA,0,Hea08_Credits)","v":0}]
[null,null,null,null,null,"No. of BREEAM credits available",null,{"$f":"IF(ADBT0=ADBT8,Hea08_03,AIS_NA)","v":"N/A"},null,null,null,null,null,"Available contribution to overall score",null,{"$f":"IFERROR((BP_33/BP_02)*Hea08_Credits,AIS_NA)","v":"N/A"}]
[]
[null,null,null,null,null,"No. of BREEAM innovation credits available",null,{"$f":"IF(ADBT0=ADBT8,0,AIS_NA)","v":"N/A"},null,null,null,null,null,"Minimum standards applicable",null,{"$f":"IF(ADBT0=ADBT8,AIS_Yes,AIS_NA)","v":"N/A"}]
[null,"Assessment Criteria",null,null,null,null,null,null,null,"Compliant?",null,"Credits available",null,"Credits achieved"]
[]
[null,null,null,null,null,null,null,"Will a compliant outdoor space be provided?",null,"No",null,{"$f":"IF(Hea08_01=AIS_NA,AIS_NA,AS1385)","v":1},null,{"$f":"IF(Hea08_01=AIS_Yes,1,0)","v":0}]
[]
[null,null,null,null,null,"Total BREEAM credits achieved",null,{"$f":"IF(ISERROR(Hea08_Tot_Err), 0, Hea08_Tot_Err)","v":0}]
[]
[null,null,null,null,null,"Total contribution to overall building score",null,{"$f":"IF(Hea08_Credits=AIS_NA,\"0.00%\",IF(Score_option=_PSc2,(Hea08_07/Hea08_Credits)*Hea08_user,(Hea08_07/Hea08_Credits)*Hea08_tot))","v":"0.00%"}]
[]
[null,null,null,null,null,"Total BREEAM innovation credits achieved",null,"N/A"]
[]
[null,null,null,null,null,"Minimum standard(s) level",null,{"$f":"IF(ADBT0=ADBT8,(VLOOKUP(MinSt_16,AIS_MinSt_benchmarks,2,FALSE)),\"N/A\")","v":"N/A"}]
[]
[null,"Comments/notes:"]
[]
[]
[]
[]
[]
[]
[]
[null,"ENERGY"]
[]
[null,"Ene01 Energy Efficiency "]
[]
[null,null,null,null,null,"No. of BREEAM credits available",null,15,null,null,null,null,null,"Available contribution to overall score",null,{"$f":"(BP_34/BP_03)*Ene01_credits","v":0.12391304347826086}]
[]
[null,null,null,null,null,"No. of BREEAM innovation credits available",null,5,null,null,null,null,null,"Minimum standards applicable",null,"Yes"]
[]
[]
[null,null,null,null,null,"Ene 01 Option selected:",null,"Option 1: National Calculation Methodology or Dynamic Simulation Modelling"]
[]
[null,"How do you wish to assess the number of BREEAM credits achieved for this issue?",null,null,null,null,null,null,null,"Please select:"]
[]
[null,"Select the target number of BREEAM credits for the Ene01 issue:"]
[]
[null,"Option 1"]
[null,"EPRINC translator set for country of assessment",null,null,null,null,null,"1. Best international practice in terms of energy efficient standards for buildings.",null,null,null,null,null,null,null,{"$f":"IF(H372=\"Option 2.\",\"\",\"Please refer to the Approved standards and weightings list for confirmation of the EPRINC translator set for the country of assessment.\")","v":"Please refer to the Approved standards and weightings list for confirmation of the EPRINC translator set for the country of assessment."}]
[]
[null,"Confirm building regulation and version used:"]
[]
[]
[null,"EPR metrics covered by local regulation:"]
[null,null,"Energy demand",null,null,null,null,"Yes",null,"Please refer to the Approved standards and weightings list for confirmation of the EPR metrics available in the local country."]
[null,null,"Primary energy consumtion",null,null,null,null,"Yes"]
[null,null,"CO2 emissions",null,null,null,null,"Yes"]
[]
[null,null,"Internal lighting included in approved building energy calculation software?",null,null,null,null,"Yes",null,null,null,null,null,null,null,"Shell & Core option?"]
[null,"Credits achieved from Checklist A5 lighting criteria (CN8) "]
[null,"Ene01 Calculator and Key Performance Indicators",null,null,null,null,null,{"$f":"IF(AND(AD_MultiRes_option01=AD_Yes,AD_MultiRes_option02<1),\"Non-Domestic Building Areas\",\"\")","v":""},null,null,null,{"$f":"IF(Ene01_80=AIS_statement91,\"Domestic Building Areas\",\"\")","v":""},null,null,null,"N/A"]
[]
[null,null,null,null,null,"Building floor area",null,{"$f":"IF(AND(AD_MultiRes_option01=AD_Yes,AD_MultiRes_option02<1),((1-AD_MultiRes_option02)*AD_GIA),AD_GIA)","v":0},null,{"$f":"IF(AD_MultiRes_option01=AD_Yes,\"\",\"m2\")","v":"m2"},null,null,null,{"$f":"IF(Ene01_80=AIS_statement91,\"m2\",\"\")","v":""}]
[null,null,null,null,null,"Notional building energy demand",null,null,null,{"$f":"IF(AD_MultiRes_option01=AD_Yes,\"\",\"MJ/m2/annum\")","v":"MJ/m2/annum"},null,null,null,{"$f":"IF(Ene01_80=AIS_statement91,\"MJ/m2/yr\",\"\")","v":""}]
[null,null,null,null,null,"Actual building energy demand",null,null,null,{"$f":"IF(AD_MultiRes_option01=AD_Yes,\"\",\"MJ/m2/annum\")","v":"MJ/m2/annum"},null,null,null,{"$f":"IF(Ene01_80=AIS_statement91,\"MJ/m2/yr\",\"\")","v":""}]
[null,null,null,null,null,"Notional building primary energy consumption",null,null,null,{"$f":"IF(AND(AD_MultiRes_option01=AD_Yes,AD_MultiRes_option02<1),\"\",\"kWh/m2/yr\")","v":"kWh/m2/yr"},null,null,null,{"$f":"IF(Ene01_80=AIS_statement91,\"kWh/m2/yr\",\"\")","v":""}]
[null,null,null,null,null,"Actual building primary energy consumption",null,null,null,{"$f":"IF(AND(AD_MultiRes_option01=AD_Yes,AD_MultiRes_option02<1),\"\",\"kWh/m2/yr\")","v":"kWh/m2/yr"},null,null,null,{"$f":"IF(Ene01_80=AIS_statement91,\"kWh/m2/yr\",\"\")","v":""}]
[null,null,null,null,null,"Notional Building Emission Rate",null,null,null,{"$f":"IF(AND(AD_MultiRes_option01=AD_Yes,AD_MultiRes_option02<1),\"\",\"kgCO2/m2/yr\")","v":"kgCO2/m2/yr"},null,null,null,{"$f":"IF(Ene01_80=AIS_statement91,\"kgCO2/m2/yr\",\"\")","v":""}]
[null,null,null,null,null,"Actual Building Emission Rate",null,null,null,{"$f":"IF(AND(AD_MultiRes_option01=AD_Yes,AD_MultiRes_option02<1),\"\",\"kgCO2/m2/yr\")","v":"kgCO2/m2/yr"},null,null,null,{"$f":"IF(Ene01_80=AIS_statement91,\"kgCO2/m2/yr\",\"\")","v":""},null,{"$f":"IF(Ene01_80=AIS_statement91,\"Area Weighted\",\"\")","v":""}]
[null,null,null,null,null,"Actual Bdg Emission Rate improvement over Notional Building",null,{"$f":"IF(ISERROR(Ene01_08_Err), \"\", Ene01_08_Err)","v":""},null,null,null,{"$f":"IF(ISERROR(Ene01_50_Err),\"\",Ene01_50_Err)","v":""},null,null,null,{"$f":"IF(ISERROR(Ene01_81),\"-\",Ene01_81)","v":0}]
[null,null,null,null,null,"Demand Energy Performance Ratio (EPR)",null,{"$f":"IF(AND(AD_MultiRes_option01=AD_Yes,AD_MultiRes_option02=1),Ene01_64,Ene01_22)","v":0},null,null,null,{"$f":"Ene01_64","v":0}]
[null,null,null,null,null,"Consumption Energy Performance Ratio (EPR)",null,{"$f":"IF(AND(AD_MultiRes_option01=AD_Yes,AD_MultiRes_option02=1),Ene01_65,Ene01_23)","v":0},null,null,null,{"$f":"Ene01_65","v":0}]
[null,null,null,null,null,"CO2 Energy Performance Ratio (EPR)",null,{"$f":"IF(AND(AD_MultiRes_option01=AD_Yes,AD_MultiRes_option02=1),Ene01_66,Ene01_24)","v":0},null,null,null,{"$f":"Ene01_66","v":2.5167442061632433E-2}]
[null,null,null,null,null,"Overall Building Energy Performance Ratio (EPRNC)",null,{"$f":"IF(AND(AD_MultiRes_option01=AD_Yes,AD_MultiRes_option02=1),Ene01_70,Ene01_25)","v":0},null,null,null,{"$f":"Ene01_70","v":2.52E-2}]
[null,null,null,null,null,"Number of BREEAM credits achieved",null,{"$f":"Ene01_74","v":0},null,null,null,{"$f":"Ene01_63","v":0}]
[]
[null,"Option 2"]
[null,null,null,null,null,"Number of Ene01 credits achieved",null,null,null,"A building services engineer must confirm Option 1 is unsuitable before using Option 2 Checklist A5 - Energy efficient features."]
[]
[]
[]
[null,"Equivalent % of the building's ‘regulated’ energy consumption generated by carbon neutral sources and used to meet energy demand from ‘unregulated’ building systems or processes?",null,null,null,null,null,null,null,null,null,null,null,null,null,null,{"$f":"IF(AND(Ene01_37=AIS_Yes,Ene01_36<1,OR(Ene01_76=AIS_Yes,Ene01_77=AIS_Yes)),AIS_Statement88,\"\")","v":""}]
[null,null,null,null,null,null,null,null,null,null,null,null,null,"Is the building designed to be 'carbon negative' ?"]
[null,null,null,null,null,null,null,null,null,null,null,null,null,"If the building is defined as 'carbon negative' what is the total (modelled) renewable/carbon neutral energy generated and exported",null,null,{"$f":"IF(Ene01_37=AIS_Yes,AIS_units29,\"\")","v":""}]
[null,null,null,null,null,null,null,null,null,null,null,null,null,null,null,null," "]
[null,null,null,null,null,{"$f":"IF(Ene01_80=AIS_statement91,\"Total 'area-weighted' BREEAM credits achieved\",\"Total BREEAM credits achieved\")","v":"Total BREEAM credits achieved"},null,{"$f":"IF(J374=Ene01_Preopt3,J376,IF(ENE01_IntLighting=AIS_Yes,Ene01_Tot_Err,Ene01_Tot_plus_lighting))","v":0}]
[]
[null,null,null,null,null,"Total contribution to overall building score",null,{"$f":"IF(Score_option=_PSc2,(Ene01_41/Ene01_credits)*Ene01_user,(Ene01_41/Ene01_credits)*Ene01_tot)","v":0}]
[]
[null,null,null,null,null,"Total BREEAM innovation credits achieved",null,{"$f":"IF(H372=X1620,0,IF(OR(Ene01_76=AIS_No,Ene01_77=AIS_No,Ene01_91=AIS_No),0,IF(Ene01_80=AIS_statement91,Ene01_79,IF(Ene01_80=AIS_Statement101,Ene01_92,IF(Ene01_80=AIS_statement90,Ene01_78)))))","v":0}]
[]
[null,null,null,null,null,"Minimum standard(s) level",null,{"$f":"IF(ISERROR(VLOOKUP(MinSt_07,AIS_MinSt_benchmarks,2,FALSE)),\"\",VLOOKUP(MinSt_07,AIS_MinSt_benchmarks,2,FALSE))","v":"Very Good"}]
[null,null,null,null,null,null,null,null,null,null,null,null,null,null,null,null,{"$f":"IF(ISERROR(IF(AND(Ene01_28=AG1386,Ene01_tot>=Ene01_31,Ene01_tot<Ene01_32),AIS_statement06,IF(AND(Ene01_tot>=Ene01_32,OR(Ene01_28=AG1386,Ene01_28=AG1385)),AIS_statement07,IF(AND(Ene01_28=AG1386,Ene01_67>=Ene01_71,Ene01_67<Ene01_72),AIS_Statement89,IF(AND(Ene01_67>=Ene01_72,OR(Ene01_28=AG1386,Ene01_28=AG1385)),AIS_statement100,\"\"))))),\"\",IF(AND(Ene01_28=AG1386,Ene01_tot>=Ene01_31,Ene01_tot<Ene01_32),AIS_statement06,IF(AND(Ene01_tot>=Ene01_32,OR(Ene01_28=AG1386,Ene01_28=AG1385)),AIS_statement07,IF(AND(Ene01_28=AG1386,Ene01_67>=Ene01_71,Ene01_67<Ene01_72),AIS_Statement89,IF(AND(Ene01_67>=Ene01_72,OR(Ene01_28=AG1386,Ene01_28=AG1385)),AIS_statement100,\"\")))))","v":""}]
[null,"Comments/notes:"]
[]
[null,"Ene02 Energy Monitoring"]
[]
[]
[null,null,null,null,null,"No. of BREEAM credits available",null,{"$f":"Ene02_04+Ene02_05+L440+L441","v":1},null,null,null,null,null,"Available contribution to overall score",null,{"$f":"(BP_34/BP_03)*Ene02_credits","v":8.2608695652173908E-3}]
[]
[null,null,null,null,null,"No. of BREEAM innovation credits available",null,0,null,null,null,null,null,"Minimum standards applicable",null,{"$f":"IF(ADBT0=ADBT8,AIS_No,AIS_Yes)","v":"Yes"}]
[null,"02a - Assessment Criteria (Non-Residential)",null,null,null,null,null,null,null,"Compliant?",null,"Credits available",null,"Credits achieved",null,"Shell & Core option?"]
[]
[null,null,null,null,null,null,null,"Will a BMS or sub-meters be specified to monitor energy use from major building services systems?",null,"No",null,{"$f":"IF(ADBT0=ADBT8,0,1)","v":1},null,{"$f":"IF(ADBT0=ADBT8,0,IF(AND((Ene02_02=AIS_Yes),(Ene02_08=\"Option 2\")),0.5,IF(AND((Ene02_02=AIS_Yes),(Ene02_08=\"Option 1\")),1,IF(AND((Ene02_02=AIS_Yes),(Ene02_08=\"Option 3\")),1,IF(AND((Ene02_02=AIS_Yes),(Ene02_08=\"N/A\")),1,0)))))","v":0},null,"N/A"]
[null,null,null,null,null,null,null,"Will a BMS or sub-meters be specified to monitor energy use by tenant/building function areas?",null,"No",null,{"$f":"IF(ADBT0=ADBT8,0,IF(AD_Multitenant=AIS_Yes,1,0))","v":0},null,{"$f":"IF(ADBT0=ADBT8,0,IF(Ene02_03=AIS_Yes,Ene02_05,0))","v":0},null,"N/A"]
[]
[]
[null,"02b - Assessment Criteria (Residential)",null,null,null,null,null,null,null,"Compliant?",null,"Credits available",null,"Credits achieved"]
[]
[null,null,null,null,null,null,null,"Will energy consumption data be displayed to occupants?",null,"No",null,{"$f":"IF(ADBT0<>ADBT8,0,1)","v":0},null,{"$f":"IF(ADBT0<>ADBT8,0,IF(J440=AIS_Yes,1,0))","v":0}]
[null,null,null,null,null,null,null,"Will primary heating fuel consumption data be displayed to occupants?",null,"No",null,{"$f":"IF(ADBT0<>ADBT8,0,1)","v":0},null,{"$f":"IF(ADBT0<>ADBT8,0,IF(J441=AIS_Yes,1,0))","v":0}]
[]
[]
[]
[]
[]
[null,null,null,null,null,"Total BREEAM credits achieved",null,{"$f":"IF(ISERROR(Ene02_Tot_Err),0,Ene02_Tot_Err)","v":0}]
[]
[null,null,null,null,null,"Total contribution to overall building score",null,{"$f":"IF(Score_option=_PSc2,(Ene02_10/Ene02_credits)*Ene02_user,(Ene02_10/Ene02_credits)*Ene02_tot)","v":0}]
[]
[null,null,null,null,null,"Total BREEAM innovation credits achieved",null,"N/A"]
[]
[null,null,null,null,null,"Minimum standard(s) level",null,{"$f":"VLOOKUP(MinSt_08,AIS_MinSt_benchmarks,2,FALSE)","v":"Good"}]
[]
[null,"Comments/notes:"]
[]
[null,"Ene03 External Lighting"]
[]
[null,null,null,null,null,"No. of BREEAM credits available",null,1,null,null,null,null,null,"Available contribution to overall score",null,{"$f":"(BP_34/BP_03)*Ene03_credits","v":8.2608695652173908E-3}]
[]
[null,null,null,null,null,"No. of BREEAM innovation credits available",null,0,null,null,null,null,null,"Minimum standards applicable",null,"No"]
[null,"Assessment Criteria",null,null,null,null,null,null,null,"Compliant?",null,"Credits available",null,"Credits achieved",null,"Shell & Core option?"]
[]
[null,null,null,null,null,null,null,"Will external light fittings and controls be specified in accordance with the BREEAM criteria?",null,"No",null,1,null,{"$f":"IF(AND(Ene03_01=AIS_Yes,(OR(Ene03_04=AIS_option05,Ene03_04=AIS_option00))),Ene03_02,IF(AND(Ene03_01=AIS_Yes,Ene03_04=AIS_option01),Ene03_02,IF(AND(Ene03_01=AIS_Yes,Ene03_04=AIS_option02),Ene03_02*0.5,IF(AND(Ene03_01=AIS_Yes,Ene03_04=AIS_option03),Ene03_02,0))))","v":0},null,"N/A"]
[]
[null,null,null,null,null,"Total BREEAM credits achieved",null,{"$f":"IF(ISERROR(N464),0,N464)","v":0}]
[]
[null,null,null,null,null,"Total contribution to overall building score",null,{"$f":"IF(Score_option=_PSc2,(Ene03_05/Ene03_credits)*Ene03_user,(Ene03_05/Ene03_credits)*Ene03_tot)","v":0}]
[]
[null,null,null,null,null,"Total BREEAM innovation credits achieved",null,"N/A"]
[]
[null,null,null,null,null,"Minimum standard(s) level",null,"N/A"]
[]
[null,"Comments/notes:"]
[]
[null,"Ene04 Low and Zero Carbon Technology"]
[]
[null,null,null,null,null,"No. of BREEAM credits available",null,2,null,null,null,null,null,"Available contribution to overall score",null,{"$f":"(BP_34/BP_03)*Ene04_credits","v":1.6521739130434782E-2}]
[]
[null,null,null,null,null,"No. of BREEAM innovation credits available",null,{"$f":"AIS_NA","v":"N/A"},null,null,null,null,null,"Minimum standards applicable",null,"Yes"]
[null,"Assessment Criteria",null,null,null,null,null,null,null,"Compliant?",null,"Credits available",null,"Credits achieved",null,"Shell & Core option?"]
[]
[null,null,null,null,null,null,null,"Will a compliant LZC feasibility study be undertaken?",null,"No",null,1,null,{"$f":"IF(AND((J483=AIS_Yes),(P483=\"Option 2: N/A\")),0,IF(AND((J483=AIS_Yes),(P483=\"Option 1\")),1,IF(AND((J483=AIS_Yes),(P483=\"Option 3\")),1,IF(AND((J483=AIS_Yes),(P483=\"N/A\")),1,0))))","v":0},null,"N/A"]
[null,null,null,null,null,null,null,"Will the compliant LCA measure the carbon footprint of the LZC system(s)?",null,"No",null,1,null,{"$f":"IF(AND(J483=AIS_Yes,J484=AIS_Yes),1,0)","v":0},null,"N/A",{"$f":"IF(N483=0,\"Not awarded if first credit not achieved.\",\"\")","v":"Not awarded if first credit not achieved."}]
[]
[]
[null,null,null,null,null,"Total BREEAM credits achieved",null,{"$f":"IF(ISERROR(Ene04_Tot_Err),AIS_Missing_data,Ene04_Tot_Err)","v":0}]
[]
[null,null,null,null,null,"Total contribution to overall building score",null,{"$f":"IF(ISERROR(Ene04_20_Err),0,Ene04_20_Err)","v":0}]
[]
[null,null,null,null,null,"Total BREEAM innovation credits achieved",null,{"$f":"AIS_NA","v":"N/A"}]
[]
[null,null,null,null,null,"Minimum standard(s) level",null,{"$f":"VLOOKUP(MinSt_09,AIS_MinSt_benchmarks,2,FALSE)","v":"Very Good"}]
[]
[null,"Comments/notes:"]
[]
[null,"Ene05 Energy Efficient Cold Storage",null,null,null,null,null,null,null,null,null,null,null,null,null,{"$f":"IF(OR(AD_refrig=\"No\",AD_refrig=\"\"),AIS_statement32,\"\")","v":"Assessment Issue Not Applicable"}]
[null,null,null,null,null,null,null,{"$f":"IF(Ene05_credits=AIS_NA,0,Ene05_credits)","v":0}]
[null,null,null,null,null,"No. of BREEAM credits available",null,{"$f":"IF(AD_refrig=AIS_Yes,3,AIS_NA)","v":"N/A"},null,null,null,null,null,"Available contribution to overall score",null,{"$f":"IF(ene05_19=AIS_statement32,AIS_NA,(BP_34/BP_03)*Ene05_credits)","v":"N/A"},{"$f":"IF(AD_refrig=AD_no,AIS_statement30,\"\")","v":""}]
[]
[null,null,null,null,null,"No. of BREEAM innovation credits available",null,{"$f":"AIS_NA","v":"N/A"},null,null,null,null,null,"Minimum standards applicable",null,{"$f":"IF(AD_refrig=AD_no,AIS_NA,\"No\")","v":"No"}]
[null,"Assessment Criteria",null,null,null,null,null,null,null,"Compliant?",null,"Credits available",null,"Credits achieved",null,"Shell & Core option?"]
[]
[null,null,null,null,null,null,null,"Will the refrigeration system be designed, installed & commissioned in accordance with BREEAM criteria?",null,"No",null,1,null,{"$f":"IF(AND((J504=AIS_Yes),(P504=\"Option 2\")),0.5,IF(AND((J504=AIS_Yes),(P504=\"Option 1\")),1,IF(AND((J504=AIS_Yes),(P504=\"Option 3\")),1,IF(AND((J504=AIS_Yes),(P504=\"N/A\")),1,0))))","v":0},null,"N/A"]
[null,null,null,null,null,null,null,"Will the components meet published energy efficiency criteria?",null,"No",null,1,null,{"$f":"IF(AND((J505=AIS_Yes),(P505=\"Option 2\")),0.5,IF(AND((J505=AIS_Yes),(P505=\"Option 1\")),1,IF(AND((J505=AIS_Yes),(P505=\"Option 3\")),1,IF(AND((J505=AIS_Yes),(P505=\"N/A\")),1,0))))","v":0},null,"N/A"]
[null,null,null,null,null,null,null,"Will the refrigeration system demonstrate a saving in indirect greenhouse gas emissions?",null,"No",null,1,null,{"$f":"IF(AND((J506=AIS_Yes),(P506=\"Option 2\")),0.5,IF(AND((J506=AIS_Yes),(P506=\"Option 1\")),1,IF(AND((J506=AIS_Yes),(P506=\"Option 3\")),1,IF(AND((J506=AIS_Yes),(P506=\"N/A\")),1,0))))","v":0},null,"N/A",{"$f":"IF(OR(Ene05_01=AIS_No,),AIS_statement28,\"\")","v":"Note: The first Ene05 credit must be achieved before the third credit can be awarded."}]
[]
[null,null,null,null,null,"Total BREEAM credits achieved",null,{"$f":"IF(ISERROR(Ene05_Tot_Err),0,Ene05_Tot_Err)","v":0}]
[]
[null,null,null,null,null,"Total contribution to overall building score",null,{"$f":"IF(ene05_19=AIS_statement32,AIS_NA,IF(Score_option=_PSc2,(Ene05_20/Ene05_credits)*Ene05_user,(Ene05_20/Ene05_credits)*Ene05_tot))","v":"N/A"}]
[]
[null,null,null,null,null,"Total BREEAM innovation credits achieved",null,{"$f":"AIS_NA","v":"N/A"}]
[]
[null,null,null,null,null,"Minimum standard(s) level",null,"N/A"]
[]
[null,"Comments/notes:"]
[]
[null,"Ene06 Energy Efficient Transportation Systems",null,null,null,null,null,null,null,null,null,null,null,null,null,{"$f":"IF(AD_Trans=AD_no,AIS_statement32,\"\")","v":""}]
[null,null,null,null,null,null,null,{"$f":"IF(Ene06_credits=AIS_NA,0,Ene06_credits)","v":2}]
[null,null,null,null,null,"No. of BREEAM credits available",null,{"$f":"IF(AD_Trans=AD_no,AIS_NA,2)","v":2},null,null,null,null,null,"Available contribution to overall score",null,{"$f":"IF(Ene06_10=AIS_statement32,AIS_NA,(BP_34/BP_03)*Ene06_credits)","v":1.6521739130434782E-2},{"$f":"IF(AD_Trans=AD_no,AIS_statement31,\"\")","v":""}]
[]
[null,null,null,null,null,"No. of BREEAM innovation credits available",null,{"$f":"IF(AD_Trans=AD_no,AIS_NA,0)","v":0},null,null,null,null,null,"Minimum standards applicable",null,"N/A"]
[null,"Assessment Criteria",null,null,null,null,null,null,null,"Compliant?",null,"Credits available",null,"Credits achieved",null,"Shell & Core option?"]
[]
[null,null,null,null,null,null,null,"Will an analysis be carried out to determine the optimum number and size of lifts/escalators?",null,"No",null,1,null,{"$f":"IF(AND((J525=AIS_Yes),(P525=\"Option 2: N/A\")),0,IF(AND((J525=AIS_Yes),(P525=\"Option 1\")),1,IF(AND((J525=AIS_Yes),(P525=\"Option 3\")),1,IF(AND((J525=AIS_Yes),(P525=\"N/A\")),1,0))))","v":0},null,"N/A"]
[null,null,null,null,null,null,null,"Will the appropriate energy efficient transportation design features be included?",null,"No",null,1,null,{"$f":"IF(AND((J526=AIS_Yes),(P526=\"Option 2: N/A\")),0,IF(AND((J526=AIS_Yes),(P526=\"Option 1\")),1,IF(AND((J526=AIS_Yes),(P526=\"Option 3\")),1,IF(AND((J526=AIS_Yes),(P526=\"N/A\")),1,0))))","v":0},null,"N/A",{"$f":"IF(AD_Trans=AD_no,\"\",IF(Ene06_01=AIS_No,AIS_statement33,\"\"))","v":"Note: The first Ene06 credit must be achieved before this credit can be awarded."}]
[]
[null,null,null,null,null,"Total BREEAM credits achieved",null,{"$f":"IF(ISERROR(Ene06_Tot_Err),0,Ene06_Tot_Err)","v":0}]
[]
[null,null,null,null,null,"Total contribution to overall building score",null,{"$f":"IF(Ene06_10=AIS_statement32,AIS_NA,IF(Score_option=_PSc2,(Ene06_11/Ene06_credits)*Ene06_user,(Ene06_11/Ene06_credits)*Ene06_tot))","v":0}]
[]
[null,null,null,null,null,"Total BREEAM innovation credits achieved",null,"N/A"]
[]
[null,null,null,null,null,"Minimum standard(s) level",null,"N/A"]
[]
[null,"Comments/notes:"]
[]
[null,"Ene07 Energy Efficient Laboratory Systems",null,null,null,null,null,null,null,null,null,null,null,null,null,{"$f":"IF(ADFume_option01=AD_no,AIS_statement32,IF(OR(OR(AD_Labsize=AD_Labsize01,AD_Labsize=AD_Labsize02),ADFume_option01=AD_Yes),\"\",AIS_statement32))","v":"Assessment Issue Not Applicable"}]
[]
[]
[null,null,null,null,null,"No. of BREEAM credits available",null,{"$f":"IF(Ene07_01=AIS_statement32,AIS_NA,IF(AND(ADFume_option01=AD_no,AD_Labsize=AD_Labsize01),2,IF(AND(ADFume_option01=AD_Yes,AD_Labsize=AD_Labsize01),3,IF(AND(ADFume_option01=AD_no,AD_Labsize=AD_Labsize02),4,IF(AND(ADFume_option01=AD_Yes,AD_Labsize=AD_Labsize02),5,IF(AND(AD_Labsize=AD_labsize04,ADFume_option01=AD_Yes),1))))))","v":"N/A"},null,null,null,null,null,"Available contribution to overall score",null,{"$f":"IF(Ene07_01=AIS_statement32,AIS_NA,(BP_34/BP_03)*Ene07_credits)","v":"N/A"},{"$f":"IF(Ene07_01=AIS_statement32,AIS_statement38,\"\")","v":"Note: You have stated in the Assessment Details tab that the assessed building does not have any laboratory areas and/or fume cupboards, therefore this issue is not applicable to the assessment."}]
[]
[null,null,null,null,null,"No. of BREEAM innovation credits available",null,{"$f":"IF(Ene07_01=AIS_statement32,AIS_NA,0)","v":"N/A"},null,null,null,null,null,"Minimum standards applicable",null,{"$f":"IF(Ene07_01=AIS_statement32,AIS_NA,AIS_No)","v":"N/A"}]
[null,"Assessment Criteria",null,null,null,null,null,null,null,"Compliant?",null,"Credits available",null,"Credits achieved",null,"Shell & Core option?"]
[]
[null,null,null,null,null,null,null,"Fume cupboards and/or other containment device specification ",null,"No",null,{"$f":"IF(ADFume_option01=AD_no,AIS_NA,1)","v":1},null,{"$f":"IF(ADFume_option01=AD_no,AIS_NA,IF(Ene07_03=AIS_No,0,IF(AND(Ene07_03=AIS_Yes,OR(ADBT_sub01=ADBT_sub06,ADBT_sub01=ADBT_sub07,ADBT_sub01=ADBT_sub08,ADBT_sub01=ADBT_sub10,ADBT_sub01=ADBT_sub11,ADBT_sub01=ADBT_sub12,ADBT_sub01=ADBT_sub13,ADBT_sub01=ADBT_sub14)),Ene07_04,IF(Hea02_05=AIS_No,0,IF(Ene07_03=AIS_Yes,Ene07_04)))))","v":0},null,"N/A",{"$f":"IF(Ene07_01=AIS_statement32,\"\",IF(ADFume_option01=AD_no,AIS_statement40,IF(OR(ADBT_sub01=ADBT_sub06,ADBT_sub01=ADBT_sub07,ADBT_sub01=ADBT_sub08,ADBT_sub01=ADBT_sub10,ADBT_sub01=ADBT_sub11,ADBT_sub01=ADBT_sub12,ADBT_sub01=ADBT_sub13,ADBT_sub01=ADBT_sub14),\"\",IF(Hea02_05=AIS_No,AIS_statement39,\"\"))))","v":""}]
[]
[null,null,null,null,null,null,null,"Best Practice Energy Practices in Laboratories (table 6-2)",null,{"$f":"IF(Ene07_09=AIS_NA,AIS_NA,IF(Ene07_09>0,AIS_Yes,AIS_No))","v":"Yes"},null,{"$f":"IF(OR(ADBT_sub01=ADBT_sub06,ADBT_sub01=ADBT_sub07,ADBT_sub01=ADBT_sub08,ADBT_sub01=ADBT_sub10,ADBT_sub01=ADBT_sub11,ADBT_sub01=ADBT_sub12,ADBT_sub01=ADBT_sub13,ADBT_sub01=ADBT_sub14),AIS_NA,IF(AD_Labsize=AD_Labsize01,2,IF(AD_Labsize=AD_Labsize02,4,IF(AD_Labsize=AD_labsize04,AIS_NA))))","v":false},null,{"$f":"IF(OR(ADBT_sub01=ADBT_sub06,ADBT_sub01=ADBT_sub07,ADBT_sub01=ADBT_sub08,ADBT_sub01=ADBT_sub10,ADBT_sub01=ADBT_sub11,ADBT_sub01=ADBT_sub12,ADBT_sub01=ADBT_sub13,ADBT_sub01=ADBT_sub14,AD_Labsize=AD_labsize04),AIS_NA,IF(ADFume_option01=AD_no,Ene07_23,IF(ADFume_option01=AD_Yes,Ene07_22)))","v":false},null,"N/A",{"$f":"IF(Ene07_01=AIS_statement32,\"\",IF(OR(ADBT_sub01=ADBT_sub06,ADBT_sub01=ADBT_sub07,ADBT_sub01=ADBT_sub08,ADBT_sub01=ADBT_sub10,ADBT_sub01=ADBT_sub11,ADBT_sub01=ADBT_sub12,ADBT_sub01=ADBT_sub13,ADBT_sub01=ADBT_sub14),AIS_statement41,IF(AND(Ene07_03=AIS_No,ADFume_option01=AD_Yes,OR(AD_Labsize=AD_Labsize01,AD_Labsize=AD_Labsize02)),AIS_statement42,\"\")))","v":""}]
[null,null,null,null,null,null,null,"Item b) Fan power",null,"No"]
[null,null,null,null,null,null,null,"Item c) Fume cupboard volume flow rates",null,"No"]
[null,null,null,null,null,null,null,"Item d) Grouping / isolation of high filtration/ventilation activities ",null,"No"]
[null,null,null,null,null,null,null,"Item e) Energy recovery - heat ",null,"No"]
[null,null,null,null,null,null,null,"Item f) Energy recovery - cooling",null,"No"]
[null,null,null,null,null,null,null,"Item g) Grouping of cooling loads ",null,"No"]
[null,null,null,null,null,null,null,"Item h) Free cooling",null,"No"]
[null,null,null,null,null,null,null,"Item i) Load responsiveness",null,"No"]
[null,null,null,null,null,null,null,"Item j) Cleanrooms",null,"No"]
[null,null,null,null,null,null,null,"Item k) Diversity",null,"No"]
[null,null,null,null,null,null,null,"Item l) Room air-change rates",null,"No"]
[]
[null,null,null,null,null,"Total BREEAM credits achieved",null,{"$f":"IF(ISERROR(Ene07_Tot_Err),0,Ene07_Tot_Err)","v":"N/A"}]
[]
[null,null,null,null,null,"Total contribution to overall building score",null,{"$f":"IF(Ene07_01=AIS_statement32,AIS_NA,(Ene07_24/Ene07_credits)*Ene07_tot)","v":"N/A"}]
[]
[null,null,null,null,null,"Total BREEAM innovation credits achieved",null,"N/A"]
[]
[null,null,null,null,null,"Minimum standard(s) level",null,"N/A"]
[]
[null,"Comments/notes:"]
[]
[null,"Ene08 Energy Efficient Equipment"]
[]
[null,null,null,null,null,"No. of BREEAM credits available",null,2,null,null,null,null,null,"Available contribution to overall score",null,{"$f":"(BP_34/BP_03)*Ene08_credits","v":1.6521739130434782E-2}]
[]
[null,null,null,null,null,"No. of BREEAM innovation credits available",null,0,null,null,null,null,null,"Minimum standards applicable",null,"No"]
[null,"Assessment Criteria",null,null,null,null,null,null,null,null,null,"Significant majority contributor",null,null,null,null,"Instruction: Please confirm the building function area/equipment present and whether it contributes to the 'significant majority' of the unregulated energy consumption in the building. "]
[]
[null,"Which of the following will be present and likely to be a/the major contributor to 'unregulated' energy use:",null,null,null,null,null,null,null,"Present"]
[null,null,null,null,null,null,null,"Small power and plug in equipment",null,"No",null,"No",null,null,null,null,{"$f":"IF(OR(AND(Ene08_01=AIS_No,Ene08_09=AIS_Yes),AND(Ene08_02=AIS_No,Ene08_10=AIS_Yes),AND(Ene08_03=AIS_No,Ene08_11=AIS_Yes),AND(Ene08_04=AIS_No,Ene08_12=AIS_Yes),AND(Ene08_05=AIS_No,Ene08_13=AIS_Yes),AND(Ene08_06=AIS_No,Ene08_14=AIS_Yes),AND(Ene08_08=AIS_No,Ene08_16=AIS_Yes)),AIS_statement35,\"\")","v":""}]
[null,null,null,null,null,null,null,"Swimming pool",null,"No",null,"No"]
[null,null,null,null,null,null,null,"Communal laundry",null,"No",null,"No"]
[null,null,null,null,null,null,null,"Data centre",null,"No",null,"No"]
[null,null,null,null,null,null,null,"IT-intensive operation areas",null,"No",null,"No",null,"Select"]
[null,null,null,null,null,null,null,"Residential areas with domestic scale appliances",null,"No",null,"No",null,"Req. E1-E3",null,null,{"$f":"IF(AND(Ene08_14=AIS_Yes,Ene08_09=AIS_No,Ene08_10=AIS_No,Ene08_11=AIS_No,Ene08_12=AIS_No,Ene08_16=AIS_No),AIS_statement34,\"\")","v":""}]
[null,null,null,null,null,null,null,"Kitchen and catering facilities",null,"No",null,"No"]
[null,null,null,null,null,null,null,null,null,"Compliant",null,"Credits available",null,"Credits achieved",null,"Shell & Core option?"]
[]
[null,null,null,null,null,null,null,"Will the significant majority contributor(s) to 'unregulated' energy use (above) meet the BREEAM criteria?",null,"No",null,2,null,{"$f":"IF(OR(ADPT=ADPT02,ADPT=ADPT04),IF(Ene08_17=AIS_No,0,IF(AND(Ene08_17=AIS_Yes,OR(Ene08_20=AIS_option01,Ene08_20=AIS_option03)),Ene08_26,IF(AND(Ene08_17=AIS_Yes,Ene08_20=AIS_option02),Ene08_26*0.5,Ene08_26))),IF(Ene08_17=AIS_Yes,Ene08_26,IF(Ene08_17=AIS_No,0)))","v":0},null,"N/A",{"$f":"IF(AND(Ene08_01=AIS_No,Ene08_02=AIS_No,Ene08_03=AIS_No,Ene08_04=AIS_No,Ene08_05=AIS_No,Ene08_06=AIS_No,Ene08_08=AIS_No,Ene08_17=AIS_Yes),AIS_statement36,IF(AND(OR(Ene08_01=AIS_Yes,Ene08_02=AIS_Yes,Ene08_03=AIS_Yes,Ene08_04=AIS_Yes,Ene08_05=AIS_Yes,Ene08_06=AIS_Yes,Ene08_08=AIS_Yes),(AND(Ene08_09=AIS_No,Ene08_10=AIS_No,Ene08_11=AIS_No,Ene08_12=AIS_No,Ene08_13=AIS_No,Ene08_14=AIS_No,Ene08_16=AIS_No))),AIS_statement36,\"\"))","v":""}]
[]
[null,null,null,null,null,"Total BREEAM credits achieved",null,{"$f":"IF(ISERROR(Ene08_19),0,Ene08_19)","v":0}]
[]
[null,null,null,null,null,"Total contribution to overall building score",null,{"$f":"IF(Score_option=_PSc2,(Ene08_27/Ene08_credits)*Ene08_user,(Ene08_27/Ene08_credits)*Ene08_tot)","v":0}]
[]
[null,null,null,null,null,"Total BREEAM innovation credits achieved",null,"N/A"]
[]
[null,null,null,null,null,"Minimum standard(s) level",null,"N/A"]
[]
[null,"Comments/notes:"]
[]
[null,"Ene09 Drying Space",null,null,null,null,null,null,null,null,null,null,null,null,null,{"$f":"IF(ADBT_sub01=ADBT_sub20,AIS_statement32,IF(OR(ADBT0=ADBT8),\"\",AIS_statement32))","v":"Assessment Issue Not Applicable"}]
[null,null,null,null,null,null,null,{"$f":"IF(Ene09_credits=AIS_NA,0,Ene09_credits)","v":0}]
[null,null,null,null,null,"No. of BREEAM credits available",null,{"$f":"IF(Ene09_06=AIS_statement32,AIS_NA,IF(OR(ADBT0=ADBT8),1,AIS_NA))","v":"N/A"},null,null,null,null,null,"Available contribution to overall score",null,{"$f":"IF(Ene09_06=AIS_statement32,AIS_NA,(BP_34/BP_03)*Ene09_credits)","v":"N/A"},{"$f":"IF(Ene09_06=AIS_statement32,AIS_statement37,\"\")","v":"Note:  This issue is not applicable to the building type and/or sub-building type selected in the Assessment Details page."}]
[]
[null,null,null,null,null,"No. of BREEAM innovation credits available",null,{"$f":"IF(Ene09_06=AIS_statement32,AIS_NA,IF(OR(ADBT0=ADBT8),0,AIS_NA))","v":"N/A"},null,null,null,null,null,"Minimum standards applicable",null,{"$f":"IF(Ene09_06=AIS_statement32,AIS_NA,IF(OR(ADBT0=ADBT8),AIS_No,AIS_NA))","v":"N/A"}]
[null,"Assessment Criteria",null,null,null,null,null,null,null,"Compliant?",null,"Credits available",null,"Credits achieved",null,"Shell & Core option?"]
[]
[null,null,null,null,null,null,null,"Will internal/external drying space and fixings be provided?",null,"No",null,1,null,{"$f":"IF(H602=AIS_NA,AIS_NA,IF(Ene09_01=AIS_No,0,IF(AND(Ene09_01=AIS_Yes,OR(Ene09_04=AIS_option00,Ene09_04=AIS_option01,Ene09_04=AIS_option03,Ene09_04=AIS_option05)),Ene09_02,IF(AND(Ene09_01=AIS_Yes,Ene09_04=AIS_option02),Ene09_02*0.5,0))))","v":"N/A"},null,"N/A"]
[]
[null,null,null,null,null,"Total BREEAM credits achieved",null,{"$f":"IF(Ene09_06=AIS_statement32,AIS_NA,IF(ISERROR(Ene09_Tot_Err),0,Ene09_Tot_Err))","v":"N/A"}]
[]
[null,null,null,null,null,"Total contribution to overall building score",null,{"$f":"IF(Ene09_06=AIS_statement32,AIS_NA,IF(Score_option=_PSc2,(Ene09_07/Ene09_credits)*Ene09_user,(Ene09_07/Ene09_credits)*Ene09_tot))","v":"N/A"}]
[]
[null,null,null,null,null,"Total BREEAM innovation credits achieved",null,"N/A"]
[]
[null,null,null,null,null,"Minimum standard(s) level",null,"N/A"]
[]
[null,"Comments/notes:"]
[]
[]
[null,"TRANSPORT"]
[]
[null,"Tra01 Public Transport Accessibility "]
[]
[null,null,null,null,null,"No. of BREEAM credits available",null,{"$f":"IF(AD_tra01type=\"\",AIS_Statement81,VLOOKUP(AD_tra01type,AD1691:AE1697,2))","v":"See instruction"},null,null,null,null,null,"Available contribution to overall score",null,{"$f":"IF(ISERROR(Tra01_07_Err),AIS_Statement81,Tra01_07_Err)","v":"See instruction"},{"$f":"IF(Tra01_07=AIS_Statement81,AIS_statement73,\"\")","v":"Instruction: the building type category must be defined for BREEAM issue Tra01 to calculate the total number of credits available for the transport section and therefore issue contribution to overall score."}]
[]
[null,null,null,null,null,"No. of BREEAM innovation credits available",null,0,null,null,null,null,null,"Minimum standards applicable",null,"No"]
[]
[null,null,null,null,null,null,null,"What is the building type category (for the purpose of Tra01 issue assessment)?","Business (office/industrial) ",{"$f":"AD_tra01type","v":0}]
[null,null,null,null,null,null,null,null,null,"Compliant",null,"Credits available",null,"Credits achieved",null,"Shell & Core option?"]
[]
[null,null,null,null,null,null,null,"Indicative public transport accessibility index:",null,null,null,{"$f":"Tra01_credits","v":"See instruction"},null,{"$f":"VLOOKUP(Tra01_03,Tra01_benchmarks,2,TRUE)","v":0},null,"N/A","Note: The Accessibility Index required for this assessment issue is sourced from the separate BREEAM Tra 01 calculator. \nSee indicative table below for the purposes of the pre-assessment."]
[null,null,null,null,null,null,null,"Will the building have a dedicated bus service?",null,"No",null,null,null,{"$f":"IF(Tra01_05>0,AIS_NA,IF(Tra01_04=AIS_Yes,1,0))","v":0},null,"N/A"]
[null,null,null,null,null,null,null,null,null,null,null,null,null,null,null,null,{"$f":"IF(Tra01_05>0,AIS_statement43,\"\")","v":""}]
[null,"AI","Indicative Accessibility Index for pre-assessment"]
[]
[null,0,"Poor or no public transport provision"]
[null,1,"A single BREEAM compliant public transport node available"]
[null,2,"Some BREEAM compliant public transport nodes/services available"]
[null,4,"A selection of BREEAM compliant public transport nodes/services available"]
[null,8,"Good provision of public transport i.e. small urban centre / suburban area"]
[null,10,"Very Good provision of public transport i.e. small/medium urban centre"]
[null,12,"Excellent provision of public transport, i.e. medium urban centre"]
[null,18,"Excellent provision of public transport, i.e. large urban/metropolitan city centre"]
[]
[null,null,null,null,null,"Total BREEAM credits achieved",null,{"$f":"IF(ISERROR(Tra01_Tot_Err),0,Tra01_Tot_Err)","v":0}]
[]
[null,null,null,null,null,"Total contribution to overall building score",null,{"$f":"IF(ISERROR(Tra01_08_Err),AIS_Statement81,Tra01_08_Err)","v":"See instruction"}]
[]
[null,null,null,null,null,"Total BREEAM innovation credits achieved",null,"N/A"]
[]
[null,null,null,null,null,"Minimum standard(s) level",null,"N/A"]
[]
[null,"Comments/notes:"]
[]
[]
[]
[]
[]
[]
[]
[null,"Tra02 Proximity to Amenities"]
[]
[null,null,null,null,null,"No. of BREEAM credits available",null,{"$f":"IF(ADBT0=ADBT8,2,1)","v":1},null,null,null,null,null,"Available contribution to overall score",null,{"$f":"IF(ISERROR(Tra02_06_Err),AIS_Statement81,Tra02_06_Err)","v":"See instruction"}]
[]
[null,null,null,null,null,"No. of BREEAM innovation credits available",null,0,null,null,null,null,null,"Minimum standards applicable",null,"No"]
[null,"Assessment Criteria",null,null,null,null,null,null,null,"Compliant?",null,"Credits available",null,"Credits achieved",null,"Shell & Core option?"]
[]
[null,null,null,null,null,null,null,"Will the building be in close proximity of and accessible to applicable amenities?",null,"No",null,{"$f":"IF(ADBT0=ADBT8,2,1)","v":1},{"$f":"IF(AND(Tra02_01=AIS_Yes,Tra02_03=\"\"),\"→\",\"\")","v":""},null,{"$f":"IF(AND(Tra02_01=AIS_Yes,Tra02_03=\"\"),\"←\",\"\")","v":""},"N/A",{"$f":"IF(Tra02_05=AIS_statement32,\"\",IF(AND(Tra02_01=AIS_No,Tra02_03>0),AIS_statement47,IF(AND(Tra02_01=AIS_Yes,OR(Tra02_03=\"\",Tra02_03=0)),AIS_statement52,IF(Tra02_03>Tra02_02,AIS_statement74,\"\"))))","v":""}]
[]
[null,null,null,null,null,null,null,"Will the building be in close proximity of and accessible to applicable amenities?",null,"No",null,1,null,{"$f":"IF(Tra02_08=AIS_Yes,Tra02_09,0)","v":0},null,"N/A"]
[]
[null,null,null,null,null,"Total BREEAM credits achieved",null,{"$f":"IF(ADBT0=ADBT8,Tra02_03,Tra02_10)","v":0}]
[]
[null,null,null,null,null,"Total contribution to overall building score",null,{"$f":"IF(ISERROR(Tra02_07_Err), AIS_Statement81,Tra02_07_Err)","v":"See instruction"}]
[]
[null,null,null,null,null,"Total BREEAM innovation credits achieved",null,"N/A"]
[]
[null,null,null,null,null,"Minimum standard(s) level",null,"N/A"]
[]
[null,"Comments/notes:"]
[]
[null,"Tra03  Alternative modes of transport "]
[]
[null,null,null,null,null,"No. of BREEAM credits available",null,{"$f":"IF(Tra03_07=AIS_Missing_data,AIS_statement49,Tra03_07)","v":2},null,null,null,null,null,"Available contribution to overall score",null,{"$f":"IF(ISERROR(Tra03_13_Err),AIS_Statement81,Tra03_13_Err)","v":"See instruction"},{"$f":"IF(Tra03_credits=AIS_Statement81,AIS_statement48,\"\")","v":""}]
[]
[null,null,null,null,null,"No. of BREEAM innovation credits available",null,1,null,null,null,null,null,"Minimum standards applicable",null,"No",{"$f":"IF(Tra01_07=AIS_Statement81,AIS_statement73,\"\")","v":"Instruction: the building type category must be defined for BREEAM issue Tra01 to calculate the total number of credits available for the transport section and therefore issue contribution to overall score."}]
[]
[null,null,null,null,null,null,null,"What is the building type category (for the purpose of Tra03 issue assessment)?",null,{"$f":"Tra03_02","v":0}]
[]
[null,"03a   -  Assessment Criteria  - Non Residential",null,null,null,null,null,null,null,"Compliant?",null,"Credits available",null,"Credits achieved",null,"Shell & Core option?"]
[null,null,null,null,null,"Which alternative provision will be implemented?",null,"Please Select",null,null,null,2,null,{"$f":"IF(AD_tra01type=AD1696,0,IF(H691=Tra03_opt0,0,IF(OR(H691=Tra03_opt1,H691=Tra03_opt2,H691=Tra03_opt3,H691=Tra03_opt4,H691=Tra03_opt5b),2,IF(H691=Tra03_opt5a,1,0))))","v":0},null,"N/A",{"$f":"IF(Tra03_02=AD1696,\"Please complete section 03b for Residential buildings\",\"\")","v":""}]
[]
[null,null,null,null,null,"Exemplary level: will a second option be implemented?",null,"Please Select"]
[null,"03b   -  Assessment Criteria  - Residential",null,null,null,null,null,null,null,"Compliant?",null,"Credits available",null,"Credits achieved",null,"Shell & Core option?"]
[null,null,null,null,null,"Which alternative provision will be implemented?",null,"Please Select",null,null,null,2,null,{"$f":"IF(AD_tra01type<>AD1696,0,IF(OR(H695=Tra03b_opt1,H695=Tra03b_opt2,H695=Tra03b_opt3_2,H695=Tra03b_opt5_2,H695=Tra03b_opt4),2,IF(OR(H695=Tra03b_opt3_1,H695=Tra03b_opt5_1),1,0)))","v":0},null,"N/A",{"$f":"IF(AD_tra01type<>AD1696,\"Please complete section 03a for Non-Residential buildings\",\"\")","v":"Please complete section 03a for Non-Residential buildings"}]
[]
[null,null,null,null,null,"Exemplary level: will a second option be implemented?",null,"Please Select"]
[]
[null,null,null,null,null,"Total BREEAM credits achieved",null,{"$f":"IF(ISERROR(Tra03_Tot_Err),0,Tra03_Tot_Err)","v":0}]
[]
[null,null,null,null,null,"Total contribution to overall building score",null,{"$f":"IF(ISERROR(Tra03_14_Err),AIS_Statement81,Tra03_14_Err)","v":"See instruction"}]
[]
[null,null,null,null,null,"Total BREEAM innovation credits achieved",null,{"$f":"IF(AND(H693=Tra03_opt0,H697=Tra03_opt0),0,1)","v":0}]
[]
[null,null,null,null,null,"Minimum standard(s) level",null,"N/A"]
[]
[null,"Comments/notes:"]
[]
[]
[]
[null,"Tra04 Maximum Car Parking Capacity",null,null,null,null,null,null,null,null,null,null,null,null,null,{"$f":"IF(OR(tra04_06=Tra03_option01,tra04_06=Tra03_option02,tra04_06=Tra03_option03,tra04_06=Tra03_option07,tra04_06=Tra03_option08,tra04_06=Tra03_option09,tra04_06=Tra03_option10,tra04_06=Tra03_option15,tra04_06=Tra03_option16,tra04_06=Tra03_option18),AIS_statement32,\"\")","v":""}]
[null,null,null,null,null,null,null,{"$f":"IF(Tra04_credits=AIS_NA,0,Tra04_credits)","v":2}]
[null,null,null,null,null,"No. of BREEAM credits available",null,{"$f":"IF(OR(ADBT0=ADBT8,ADBT0=ADBT3,AD_tra01type=\"Type 7 - Transport Hub Bespoke\"),\"N/A\",2)","v":2},null,null,null,null,null,"Available contribution to overall score",null,{"$f":"IF(ISERROR(Tra04_09_Err),AIS_NA,Tra04_09_Err)","v":"N/A"},{"$f":"IF(P711=AIS_statement32,AIS_statement53,\"\")","v":""}]
[]
[null,null,null,null,null,"No. of BREEAM innovation credits available",null,{"$f":"IF(Tra04_07=AIS_statement32,AIS_NA,0)","v":0},null,null,null,null,null,"Minimum standards applicable",null,{"$f":"IF(Tra04_07=AIS_statement32,AIS_NA,AIS_No)","v":"No"}]
[]
[null,null,null,null,null,null,null,"Building type category (for the purpose of Tra04 issue)?",null,{"$f":"AD_tra01type","v":0},null,null,null,null,null,null,"Instruction: the building type category must be defined for BREEAM issue Tra01 to calculate the total number of credits available for the transport section and therefore issue contribution to overall score."]
[null,null,null,null,null,null,null,"Building's indicative Accessibility Index (sourced from issue Tra01)",null,{"$f":"IF(Tra03_02=Tra03_option00,\"\",IF(Tra03_02=Tra03_option06,\"\",Tra01_03))","v":0}]
[null,"Assessment Criteria",null,null,null,null,null,null,null,"Compliant?",null,null,null,null,null,"Shell & Core option?"]
[]
[null,null,null,null,null,null,null,"Will BREEAM's maximum parking capacity criteria for the building type/Accessibility Index be met?",null,"Please select",null,null,null,null,null,"N/A"]
[]
[null,null,null,null,null,"Total BREEAM credits achieved",null,{"$f":"IF(ISERROR(Tra04_Tot_Err),0,Tra04_Tot_Err)","v":0}]
[]
[null,null,null,null,null,"Total contribution to overall building score",null,{"$f":"IF(ISERROR(Tra04_10_Err),AIS_NA,Tra04_10_Err)","v":"N/A"}]
[]
[null,null,null,null,null,"Total BREEAM innovation credits achieved",null,"N/A"]
[]
[null,null,null,null,null,"Minimum standard(s) level",null,"N/A"]
[]
[null,"Comments/notes:"]
[]
[null,"Tra05 Travel Plan"]
[null,null,null,null,null,null,null,{"$f":"IF(Tra05_credits=AIS_NA,0,Tra05_credits)","v":1}]
[null,null,null,null,null,"No. of BREEAM credits available",null,{"$f":"IF(ADBT0=ADBT8,AIS_NA,1)","v":1},null,null,null,null,null,"Available contribution to overall score",null,{"$f":"IF(ISERROR(Tra05_04_Err),AIS_NA,Tra05_04_Err)","v":"N/A"}]
[]
[null,null,null,null,null,"No. of BREEAM innovation credits available",null,0,null,null,null,null,null,"Minimum standards applicable",null,"No"]
[null,"Assessment Criteria",null,null,null,null,null,null,null,"Compliant?",null,"Credits available",null,"Credits achieved",null,"Shell & Core option?"]
[]
[null,null,null,null,null,null,null,"Will a transport plan based on site specific travel survey/assessment be developed?",null,"No",null,{"$f":"Tra05_credits","v":1},null,{"$f":"IF(AND(Tra05_01=AIS_Yes,ADBT0<>ADBT8),Tra05_02,0)","v":0},null,"N/A"]
[]
[null,null,null,null,null,"Total BREEAM credits achieved",null,{"$f":"IF(ISERROR(Tra05_03),0,Tra05_03)","v":0}]
[]
[null,null,null,null,null,"Total contribution to overall building score",null,{"$f":"IF(ISERROR(Tra05_05_Err),AIS_NA,Tra05_05_Err)","v":"N/A"}]
[]
[null,null,null,null,null,"Total BREEAM innovation credits achieved",null,"N/A"]
[]
[null,null,null,null,null,"Minimum standard(s) level",null,"N/A"]
[]
[null,"Comments/notes:"]
[]
[]
[]
[null,"Tra06 Home Office"]
[null,null,null,null,null,null,null,{"$f":"IF(Tra06_credits=AIS_NA,0,Tra06_credits)","v":0}]
[null,null,null,null,null,"No. of BREEAM credits available",null,{"$f":"IF(ADBT0=ADBT8,1,\"N/A\")","v":"N/A"},null,null,null,null,null,"Available contribution to overall score",null,{"$f":"IF(ISERROR(Tra06_04_err),AIS_Statement81,Tra06_04_err)","v":"See instruction"}]
[]
[null,null,null,null,null,"No. of BREEAM innovation credits available",null,0,null,null,null,null,null,"Minimum standards applicable",null,"No"]
[null,"Assessment Criteria",null,null,null,null,null,null,null,"Compliant?",null,"Credits available",null,"Credits achieved",null,"Shell & Core option?"]
[]
[null,null,null,null,null,null,null,"Will a home office with adequate space and services be provided?",null,"No",null,{"$f":"H756","v":"N/A"},null,{"$f":"IF(AND(Tra06_01=AIS_Yes,ADBT0=ADBT8),Tra06_02,0)","v":0},null,"N/A"]
[]
[null,null,null,null,null,"Total BREEAM credits achieved",null,{"$f":"IF(ISERROR(Tra06_03),0,Tra06_03)","v":0}]
[]
[null,null,null,null,null,"Total contribution to overall building score",null,{"$f":"IF(ISERROR(Tra06_05_err),AIS_Statement81,Tra06_05_err)","v":0}]
[]
[null,null,null,null,null,"Total BREEAM innovation credits achieved",null,"N/A"]
[]
[null,null,null,null,null,"Minimum standard(s) level",null,"N/A"]
[]
[null,"Comments/notes:"]
[]
[]
[]
[]
[]
[]
[]
[null,"WATER"]
[]
[null,"Wat01 Water Consumption"]
[]
[null,null,null,null,null,"No. of BREEAM credits available",null,5,null,null,null,null,null,"Available contribution to overall score",null,{"$f":"(BP_36/BP_05)*Wat01_credits","v":3.3333333333333333E-2}]
[]
[null,null,null,null,null,"No. of BREEAM innovation credits available",null,1,null,null,null,null,null,"Minimum standards applicable",null,"Yes"]
[null,null,null,null,null,null,null,null,null,null,null,null,null,null,null,"Shell & Core option?",{"$f":"IF(OR(ADPT=ADPT01,ADPT=ADPT03),\"\",IF(Wat01_12=AIS_option02a,AIS_statement26,\"\"))","v":""}]
[null,null,null,null,null,"Please select the calculation procedure used",null,"Alternative approach"]
[]
[null,null,null,null,null,"Preciptation Zone",null,"Zone 1",null,null,null,null,null,null,null,null,{"$f":"IF(OR(ADPT=ADPT01,ADPT=ADPT03),\"\",IF(Wat01_12=AIS_option02a,AIS_statement26,\"\"))","v":""}]
[]
[null,{"$f":"AIS_option11","v":"Standard approach data"}]
[]
[null,null,null,null,null,null,null,"Water Consumption from building micro-components ",null,null,null,{"$f":"IF(Wat01_01=AIS_option09,AIS_units13,\"\")","v":""}]
[null,null,null,null,null,null,null,"Water demand met via greywater/rainwater sources",null,null,null,{"$f":"IF(Wat01_01=AIS_option09,AIS_units13,\"\")","v":""}]
[null,null,null,null,null,null,null,"Total net water consumption",null,null,null,{"$f":"IF(Wat01_01=AIS_option09,AIS_units13,\"\")","v":""}]
[null,null,null,null,null,null,null,"Improvement on baseline performance",null,null,null,{"$f":"IF(Wat01_01=AIS_option09,AIS_units12,\"\")","v":""}]
[null,"Key Performance Indicator - use of freshwater resource"]
[]
[null,null,null,null,null,null,null,"Total net Water Consumption ",null,null,null,{"$f":"IF(Wat01_01=AIS_option09,AIS_units14,IF(Wat01_01=AIS_option10,AIS_statement03,\"\"))","v":"Indicator Not Assessed"}]
[null,null,null,null,null,null,null,"Default building occupancy",null,null,null,{"$f":"IF(Wat01_01=AIS_option10,AIS_statement03,\"\")","v":"Indicator Not Assessed"}]
[]
[null,{"$f":"AIS_option12","v":"Alternative approach data"}]
[]
[null,null,null,null,null,null,null,"What is the target for % reduction in potable water consumption for sanitary use in the building?",null,"Select percentage improvement:",null,null,null,null,null,"N/A"]
[null,null,null,null,null,null,null,null,{"$f":"IF(OR(Wat01_16=AB1760,Wat01_16=AB1761,Wat01_16=AB1762),\"→\",\"\")","v":""},null,{"$f":"IF(OR(Wat01_16=AB1760,Wat01_16=AB1761,Wat01_16=AB1762),\"←\",\"\")","v":""}]
[]
[]
[null,null,null,null,null,"Total BREEAM credits achieved",null,{"$f":"IF(ISERROR(Wat01_Tot_Err),AIS_Missing_data,Wat01_Tot_Err)","v":0}]
[]
[null,null,null,null,null,"Total contribution to overall building score",null,{"$f":"IF(ISERROR(Wat01_15_Err),AIS_Missing_data,Wat01_15_Err)","v":0}]
[]
[null,null,null,null,null,"Total BREEAM innovation credits achieved",null,{"$f":"IF(AND(OR(ADPT=ADPT02,ADPT=ADPT04),Wat01_12=AIS_option02a),0,IF(Wat01_01=AIS_option09,VLOOKUP(Wat01_05,Wat01_Exemp,2,TRUE),IF(Wat01_01=AIS_option10,IF(Wat01_10=Wat01_exemplary,1,0))))","v":0}]
[]
[null,null,null,null,null,"Minimum standard(s) level",null,{"$f":"VLOOKUP(MinSt_10,AIS_MinSt_benchmarks,2,FALSE)","v":"Good"}]
[]
[null,"Comments/notes:"]
[]
[null,"Wat02 Water Monitoring"]
[]
[null,null,null,null,null,"No. of BREEAM credits available",null,1,null,null,null,null,null,"Available contribution to overall score",null,{"$f":"(BP_36/BP_05)*Wat02_credits","v":6.6666666666666662E-3}]
[]
[null,null,null,null,null,"No. of BREEAM innovation credits available",null,0,null,null,null,null,null,"Minimum standards applicable",null,"Yes"]
[null,"Assessment Criteria",null,null,null,null,null,null,null,"Compliant?",null,"Credits available",null,"Credits achieved",null,"Shell & Core option?"]
[]
[null,null,null,null,null,null,null,"Will there be a water meter on the mains water supply to the building(s)?",null,"No",null,{"$f":"Wat02_credits","v":1},null,{"$f":"IF(OR(Wat02_02=AIS_No,Wat02_03=AIS_No,Wat02_02=\"\",Wat02_04=AIS_No,Wat02_05=AIS_No),0,IF(OR(Wat02_08=AIS_option00,Wat02_08=AIS_option01,Wat02_08=AIS_option03,Wat02_08=AIS_option05),Wat02_06,IF(Wat02_08=AIS_option02,Wat02_06*0.5,IF(Wat02_08=AIS_option04,0,Wat02_06))))","v":0},null,"N/A"]
[null,null,null,null,null,null,null,"Will metering/monitoring equipment be specified on the water supply to any relevant plant/building areas?",null,"No"]
[null,null,null,null,null,null,null,"Will all specified water meters have a pulsed output?",null,"No"]
[null,null,null,null,null,null,null,"If the site/building has an existing BMS connection, will all pulsed meters be connected to the BMS?",null,"No"]
[]
[null,null,null,null,null,"Total BREEAM credits achieved",null,{"$f":"IF(ISERROR(Wat02_07),0,Wat02_07)","v":0}]
[]
[null,null,null,null,null,"Total contribution to overall building score",null,{"$f":"IF(Score_option=_PSc2,(Wat02_12/Wat02_credits)*Wat02_user,(Wat02_12/Wat02_credits)*Wat02_tot)","v":0}]
[]
[null,null,null,null,null,"Total BREEAM innovation credits achieved",null,"N/A"]
[]
[null,null,null,null,null,"Minimum standard(s) level",null,{"$f":"VLOOKUP(MinSt_11,AIS_MinSt_benchmarks,2,FALSE)","v":"Pass"}]
[]
[null,"Comments/notes:"]
[]
[null,"Wat03 Water Leak Detection and Prevention"]
[null,null,null,null,null,null,null,{"$f":"IF(Wat03_credits=AIS_NA,0,Wat03_credits)","v":2}]
[null,null,null,null,null,"No. of BREEAM credits available",null,{"$f":"IF(ADBT0=ADBT8,AIS_NA,2)","v":2},null,null,null,null,null,"Available contribution to overall score",null,{"$f":"IF(ISERROR((BP_36/BP_05)*Wat03_credits),0,(BP_36/BP_05)*Wat03_credits)","v":1.3333333333333332E-2}]
[]
[null,null,null,null,null,"No. of BREEAM innovation credits available",null,0,null,null,null,null,null,"Minimum standards applicable",null,"No"]
[null,"Assessment Criteria",null,null,null,null,null,null,null,"Compliant?",null,"Credits available",null,"Credits achieved",null,"Shell & Core option?"]
[]
[null,null,null,null,null,null,null,"Will a mains water leak detection system be installed on the building's mains water supply?",null,"No",null,1,null,{"$f":"IF(ADBT0=ADBT8,0,IF(AND(Wat03_01=AIS_Yes,OR(Wat03_07=AIS_option00,Wat03_07=AIS_option01,Wat03_07=AIS_option05,Wat03_07=AIS_option03)),Wat03_03,IF(AND(Wat03_01=AIS_Yes,Wat03_07=AIS_option02),Wat03_03*0.5,0)))","v":0},null,"N/A"]
[null,null,null,null,null,null,null,"Will a flow control device be fitted to each sanitary area/facility?",null,"No",null,1,null,{"$f":"IF(ADBT0=ADBT8,0,IF(AND(Wat03_02=AIS_Yes,OR(Wat03_08=AIS_option00,Wat03_08=AIS_option01,Wat03_08=AIS_option05,Wat03_08=AIS_option03)),Wat03_04,IF(AND(Wat03_02=AIS_Yes,Wat03_08=AIS_option02),Wat03_04*0.5,0)))","v":0},null,"N/A"]
[]
[null,null,null,null,null,"Total BREEAM credits achieved",null,{"$f":"IF(ISERROR(Wat03_05+Wat03_06),0,Wat03_05+Wat03_06)","v":0}]
[]
[null,null,null,null,null,"Total contribution to overall building score",null,{"$f":"IF(ISERROR((Wat03_09/Wat03_credits)*Wat03_tot),0,IF(Score_option=_PSc2,(Wat03_09/Wat03_credits)*Wat03_user,(Wat03_09/Wat03_credits)*Wat03_tot))","v":0}]
[]
[null,null,null,null,null,"Total BREEAM innovation credits achieved",null,"N/A"]
[]
[null,null,null,null,null,"Minimum standard(s) level",null,"N/A"]
[]
[null,"Comments/notes:"]
[]
[null,"Wat04 Water Efficient Equipment",null,null,null,null,null,null,null,null,null,null,null,null,null,{"$f":"IF(AND(AD_Landscape=AD_no,AD_Vehiclewash=AD_no),AIS_statement32,\"\")","v":""}]
[null,null,null,null,null,null,null,{"$f":"IF(Wat04_credits=AIS_NA,0,Wat04_credits)","v":1}]
[null,null,null,null,null,"No. of BREEAM credits available",null,{"$f":"IF(Wat04_01=AIS_statement32,AIS_NA,1)","v":1},null,null,null,null,null,"Available contribution to overall score",null,{"$f":"IF(Wat04_01=AIS_statement32,AIS_NA,(BP_36/BP_05)*Wat04_credits)","v":6.6666666666666662E-3},{"$f":"IF(Wat04_01=AIS_statement32,AIS_statement45,\"\")","v":""}]
[]
[null,null,null,null,null,"No. of BREEAM innovation credits available",null,{"$f":"IF(Wat04_01=AIS_statement32,AIS_NA,0)","v":0},null,null,null,null,null,"Minimum standards applicable",null,{"$f":"IF(Wat04_01=AIS_statement32,AIS_NA,AIS_No)","v":"No"}]
[null,"Assessment Criteria",null,null,null,null,null,null,null,"Compliant?",null,"Credits available",null,"Credits achieved",null,"Shell & Core option?"]
[]
[null,null,null,null,null,null,null,"Will water efficient irrigation methods be installed (including vehicle wash systems where specified)?",null,"No",null,1,null,{"$f":"IF(Wat04_01=AIS_statement32,AIS_NA,IF(AND(AD_Vehiclewash=AD_Yes,Hea04_01=AD_no),0,IF(Wat04_02=AIS_Yes,Wat04_03,0)))","v":0},null,"N/A",{"$f":"IF(AND(AD_Vehiclewash=AD_Yes,Hea04_01=AD_no),AIS_statement46,\"\")","v":""}]
[]
[null,null,null,null,null,"Total BREEAM credits achieved",null,{"$f":"IF(ISERROR(Wat04_Tot_Err),0,Wat04_Tot_Err)","v":0}]
[]
[null,null,null,null,null,"Total contribution to overall building score",null,{"$f":"IF(Wat04_01=AIS_statement32,AIS_NA,IF(Score_option=_PSc2,Wat04_05/Wat04_credits*Wat04_user,Wat04_05/Wat04_credits*Wat04_tot))","v":0}]
[]
[null,null,null,null,null,"Total BREEAM innovation credits achieved",null,"N/A"]
[]
[null,null,null,null,null,"Minimum standard(s) level",null,"N/A"]
[]
[null,"Comments/notes:"]
[]
[]
[null,"MATERIALS"]
[]
[null,"Mat01 Life Cycle Impacts"]
[]
[null,null,null,null,null,"No. of BREEAM credits available",null,{"$f":"IF(ADBT0=ADBT2,2,6)","v":6},null,null,null,null,null,"Available contribution to overall score",null,{"$f":"(BP_38/BP_06)*Mat01_credits","v":6.8181818181818177E-2}]
[]
[null,null,null,null,null,"No. of BREEAM innovation credits available",null,1,null,null,null,null,null,"Minimum standards applicable",null,"No"]
[null,"Assessment Criteria",null,null,null,null,null,null,null,null,null,null,null,null,null,"Shell & Core option?"]
[null,null,null,null,null,null,null,"Will the project use a life cycle assessment (LCA) tool to measure impact of the building elements?",null,"No"]
[]
[null,null,null,null,null,null,null,"All Mandatory requirements and building elements in Mat01 tool will be met.",null,"No",null,null,null,null,null,"N/A"]
[]
[null,null,null,null,null,null,null,"Predicted number of Mat01 credits to be achieved:",null,null,null,null,null,null,null,null,{"$f":"IF(Mat01_03>Mat01_credits,AIS_statement74,\"\")","v":""}]
[null,null,null,null,null,null,null,"Percentage of Mat01 points achieved"]
[null,null,null,null,null,null,null,"Exemplary level compliant?",null,"No"]
[]
[null,"Key Performance Indicator - embodied green house gas emissions by element",null,null,null,null,null,null,null,"Total area of element m2",null,"Total impact\nkgCO2 eq.",null,"Area of element impact data relevant to m2"]
[]
[null,null,null,null,null,null,null,"External walls",null,null,null,null,null,null,null,null,"Note: where the element is not present in the building (or it is present but does not require assessment using BREEAM) please insert \"N/A\" in each of the relevant cells. If the element is present and assessed using BREEAM but the impact data is not available and/or not reported please insert \"INA\", i.e. Indicator Not Assessed, in the 'total impact'  cell and 'area of the element that the reported impact data covers' cell . In such cases please continue to state the area of the element present as this is used to determine the proportion of the applicable building elements that the reported impact data covers."]
[null,null,null,null,null,null,null,"Windows"]
[null,null,null,null,null,null,null,"Roof"]
[null,null,null,null,null,null,null,"Upper floor construction"]
[null,null,null,null,null,null,null,"Internal wall"]
[null,null,null,null,null,null,null,"Floor finishes/coverings"]
[null,"Key Performance Indicator - embodied green house gas emissions for building (assessed elements only)"]
[]
[null,null,null,null,null,null,null,"Total embodied green house gas emissions for building (by assessed elements)",null,{"$f":"IF(Mat01_datacheck=AIS_No,AIS_Missing_data,SUM(Mat01_totalimpact))","v":"Missing data"},null,"kgCO2 eq.",null,{"$f":"IF(Mat01_KPI01=AIS_Missing_data,\"\",(Mat01_KPI01/AD_GIA))","v":""},null,"kgCO2 eq./m2"]
[null,null,null,null,null,null,null,"Proportion of applicable building elements that data reported covers",null,{"$f":"IF(Mat01_KPI01=AIS_Missing_data,\"\",SUM(Mat01_dataapp)/SUM(Mat01_totalarea))","v":""}]
[]
[null,null,null,null,null,"Total BREEAM credits achieved",null,{"$f":"IF(OR(Mat01_Reqmet=AIS_No,Mat01_Reqmet=\"\"),0,IF(ISERROR(Mat01_03),0,Mat01_03))","v":0}]
[]
[null,null,null,null,null,"Total contribution to overall building score",null,{"$f":"IF(Score_option=_PSc2,(Mat01_27/Mat01_credits)*Mat01_user,(Mat01_27/Mat01_credits)*Mat01_tot)","v":0}]
[]
[null,null,null,null,null,"Total BREEAM innovation credits achieved",null,{"$f":"IF(OR(Mat01_07=AIS_No,Mat01_07=\"\"),0,IF(Mat01_07=AIS_Yes,Mat01_02))","v":0}]
[]
[null,null,null,null,null,"Minimum standard(s) level",null,"N/A"]
[]
[null,"Comments/notes:"]
[]
[null,"Mat03 Responsible Sourcing"]
[]
[null,null,null,null,null,"No. of BREEAM credits available",null,3,null,null,null,null,null,"Available contribution to overall score",null,{"$f":"(BP_38/BP_06)*Mat03_credits","v":3.4090909090909088E-2},"Note: The Mat03 data required for reporting purposes is sourced from BREEAM's Mat03 calculator."]
[]
[null,null,null,null,null,"No. of BREEAM innovation credits available",null,1,null,null,null,null,null,"Minimum standards applicable",null,"Yes"]
[]
[]
[null,"How do you wish to assess the number of BREEAM credits to be achieved for this issue?",null,null,null,null,null,null,null,"Please select:"]
[]
[null,null,null,null,null,null,null,"Will all timber will be legally harvested and legally traded?",null,"Please select"]
[]
[null,null,null,null,null,null,null,"Select the number of BREEAM credits being targeted for issue Mat03 ",null,0,null,"BREEAM Innovation credits:"]
[]
[null,"Assessment Criteria",null,null,null,null,null,null,null,"Compliant",null,"Credits available",null,"Credits achieved",null,"Shell & Core option?"]
[]
[null,null,null,null,null,null,null,"Predicted percentage of available responsible sourcing points achieved:",null,{"$f":"IF(ISERROR(Mat03_03_Err),AIS_No,Mat03_03_Err)","v":"No"},null,{"$f":"Mat03_credits","v":3},null,{"$f":"IF(ISERROR(Mat03_05_Err),0,Mat03_05_Err)","v":0},null,"N/A"]
[]
[null,"For each element below please confirm if it is present or not and, where present, confirm whether or not it will be responsibly sourced and the responsible sourcing tier level."]
[null,"Building elements",null,null,null,null,null,null,null,"Element present / assessed",null,"% element responsibly sourced",null,"Responsible sourcing points"]
[]
[null,null,null,null,null,null,null,"Structural Frame",null,"No",null,null,null,null,null,null,{"$f":"IF(Mat03_25=\"\",\"\",IF(OR(Mat03_07=AIS_No,Mat03_16<0.8),AIS_statement62,\"\"))","v":""}]
[null,null,null,null,null,null,null,"Ground floor",null,"No",null,null,null,null,null,null,{"$f":"IF(Mat03_26=\"\",\"\",IF(OR(Mat03_08=AIS_No,Mat03_17<0.8),AIS_statement62,\"\"))","v":""}]
[null,null,null,null,null,null,null,"Upper floors (including separating floors)",null,"No",null,null,null,null,null,null,{"$f":"IF(Mat03_27=\"\",\"\",IF(OR(Mat03_09=AIS_No,Mat03_18<0.8),AIS_statement62,\"\"))","v":""}]
[null,null,null,null,null,null,null,"Roof",null,"No",null,null,null,null,null,null,{"$f":"IF(Mat03_28=\"\",\"\",IF(OR(Mat03_10=AIS_No,Mat03_19<0.8),AIS_statement62,\"\"))","v":""}]
[null,null,null,null,null,null,null,"External walls",null,"No",null,null,null,null,null,null,{"$f":"IF(Mat03_29=\"\",\"\",IF(OR(Mat03_11=AIS_No,Mat03_20<0.8),AIS_statement62,\"\"))","v":""}]
[null,null,null,null,null,null,null,"Internal walls",null,"No",null,null,null,null,null,null,{"$f":"IF(Mat03_30=\"\",\"\",IF(OR(Mat03_12=AIS_No,Mat03_21<0.8),AIS_statement62,\"\"))","v":""}]
[null,null,null,null,null,null,null,"Foundation/substructure",null,"No",null,null,null,null,null,null,{"$f":"IF(Mat03_31=\"\",\"\",IF(OR(Mat03_13=AIS_No,Mat03_22<0.8),AIS_statement62,\"\"))","v":""}]
[null,null,null,null,null,null,null,"Fittings",null,"No",null,null,null,null,null,null,{"$f":"IF(Mat03_32=\"\",\"\",IF(OR(Mat03_14=AIS_No,Mat03_23<0.8),AIS_statement62,\"\"))","v":""}]
[null,null,null,null,null,null,null,"Hard landscaping",null,"No",null,null,null,null,null,null,{"$f":"IF(Mat03_33=\"\",\"\",IF(OR(Mat03_15=AIS_No,Mat03_24<0.8),AIS_statement62,\"\"))","v":""}]
[]
[]
[null,null,null,null,null,"Total BREEAM credits achieved",null,{"$f":"IF(Mat03_Preopt=Mat03_Preopt2,Mat03_target,IF(ISERROR(Mat03_05),0,Mat03_05))","v":0}]
[]
[null,null,null,null,null,"Total contribution to overall building score",null,{"$f":"IF(Score_option=_PSc2,(Mat03_37/Mat03_credits)*Mat03_user,(Mat03_37/Mat03_credits)*Mat03_tot)","v":0}]
[]
[null,null,null,null,null,"Total BREEAM innovation credits achieved",null,{"$f":"IF(Mat03_Preopt=Mat03_Preopt2,Mat03_target_innov,IF(OR(Mat03_03=AIS_No,Mat03_03=AIS_Error),0,IF(Mat03_03>=Mat03_exemp,Mat03_02,0)))","v":0}]
[]
[null,null,null,null,null,"Minimum standard(s) level",null,{"$f":"VLOOKUP(MinSt_12,AIS_MinSt_benchmarks,2,FALSE)","v":"Excellent"}]
[]
[null,"Comments/notes:"]
[]
[null,"Mat04 Insulation"]
[]
[null,null,null,null,null,"No. of BREEAM credits available",null,1,null,null,null,null,null,"Available contribution to overall score",null,{"$f":"(BP_38/BP_06)*Mat04_credits","v":1.1363636363636364E-2},"Note: The Mat04 data required for reporting purposes is sourced from BREEAM's Mat04 calculator."]
[]
[null,null,null,null,null,"No. of BREEAM innovation credits available",null,0,null,null,null,null,null,"Minimum standards applicable",null,"No"]
[null,"Assessment Criteria",null,null,null,null,null,null,null,"Compliant?",null,"Credits available",null,"Credits achieved",null,"Shell & Core option?"]
[]
[null,null,null,null,null,null,null,"Will 80% of the building's insulating materials be responsibly sourced?",null,"No",null,{"$f":"Mat04_credits","v":1},null,{"$f":"IF(AND(Mat04_02=AIS_Yes,OR(Mat04_08=AIS_option00,Mat04_08=AIS_option01,Mat04_08=AIS_option03,Mat04_08=AIS_option05)),Mat04_04,IF(AND(Mat04_02=AIS_Yes,Mat04_08=AIS_option02),Mat04_04*0.5,0))","v":0},null,"N/A",{"$f":"IF(Mat04_02<0.8,AIS_statement64,\"\")","v":""}]
[]
[null,null,null,null,null,"Total BREEAM credits achieved",null,{"$f":"Mat04_06","v":0}]
[]
[null,null,null,null,null,"Total contribution to overall building score",null,{"$f":"IF(Score_option=_PSc2,(Mat04_09/Mat04_credits)*Mat04_user,(Mat04_09/Mat04_credits)*Mat04_tot)","v":0}]
[]
[null,null,null,null,null,"Total BREEAM innovation credits achieved",null,"N/A"]
[]
[null,null,null,null,null,"Minimum standard(s) level",null,"N/A"]
[]
[null,"Comments/notes:"]
[]
[null,"Mat05 Designing for Robustness"]
[]
[null,null,null,null,null,"No. of BREEAM credits available",null,1,null,null,null,null,null,"Available contribution to overall score",null,{"$f":"(BP_38/BP_06)*Mat05_credits","v":1.1363636363636364E-2}]
[]
[null,null,null,null,null,"No. of BREEAM innovation credits available",null,0,null,null,null,null,null,"Minimum standards applicable",null,"N/A"]
[null,"Assessment Criteria",null,null,null,null,null,null,null,"Compliant?",null,"Credits available",null,"Credits achieved",null,"Shell & Core option?"]
[]
[null,null,null,null,null,null,null,"Will suitable durability/protection measures be specified and installed to vulnerable areas of the building?",null,"No",null,{"$f":"Mat05_credits","v":1},null,{"$f":"IF(AND(Mat05_01=AIS_Yes,OR(Mat05_04=AIS_option00,Mat05_04=AIS_option01,Mat05_04=AIS_option05,Mat05_04=AIS_option03)),Mat05_02,IF(AND(Mat05_01=AIS_Yes,Mat05_04=AIS_option02),Mat05_02*0.5,0))","v":0},null,"N/A"]
[]
[null,null,null,null,null,"Total BREEAM credits achieved",null,{"$f":"IF(ISERROR(Mat05_03),0,Mat05_03)","v":0}]
[]
[null,null,null,null,null,"Total contribution to overall building score",null,{"$f":"IF(Score_option=_PSc2,Mat05_05/Mat05_credits*Mat05_user,Mat05_05/Mat05_credits*Mat05_tot)","v":0}]
[]
[null,null,null,null,null,"Total BREEAM innovation credits achieved",null,"N/A"]
[]
[null,null,null,null,null,"Minimum standard(s) level",null,"N/A"]
[]
[null,"Comments/notes:"]
[]
[]
[null,"WASTE"]
[]
[null,"Wst01 Construction Waste Management"]
[]
[null,null,null,null,null,"No. of BREEAM credits available",null,3,null,null,null,null,null,"Available contribution to overall score",null,{"$f":"(BP_39/BP_07)*Wst01_credits","v":4.4999999999999998E-2}]
[]
[null,null,null,null,null,"No. of BREEAM innovation credits available",null,1,null,null,null,null,null,"Minimum standards applicable",null,"Yes"]
[]
[null,"How do you wish to assess the number of BREEAM credits to be achieved for this issue?",null,null,null,null,null,null,null,"Please select:"]
[]
[null,null,null,null,null,null,null,"Select the number of BREEAM credits being targeted for issue Wst 01:",null,0,null,"BREEAM Innovation credits:",null,null,null,0]
[]
[null,"Assessment Criteria\n\nConstruction resource efficiency",null,null,null,null,null,null,null,"Compliant?",null,null,null,null,null,"Shell & Core option?",{"$f":"IF(ADAS0=ADAS02,AIS_statement58,\"\")","v":""}]
[]
[null,null,null,null,null,null,null,"Targets set for non-hazardous and hazardous waste produced on site",null,"No",null,null,null,null,null,"N/A"]
[null,null,null,null,null,null,null,"Procedures are in place to minimise non-hazardous and hazardous waste",null,"No",null,null,null,null,null,null,"Note: If data not available then insert \"INA\" (i.e. Indicator not assessed) in the relevant cell."]
[null,null,null,null,null,null,null,"Site construction waste is being monitored and targets regularly reviewed",null,"No"]
[null,null,null,null,null,null,null,"Management has nominated individual responsible for implementing the above",null,"No"]
[null,null,null,null,null,null,null,"Pre-demolition audit completed",null,"No"]
[null,null,null,null,null,null,null,"Amount of waste generated will be reported via BREEAM Scoring & Reporting tool",null,"No"]
[]
[null,null,null,null,null,null,null,"Waste generated per 100m2  (m3 or tonnes)",null,1,null,"m3/100m2"]
[]
[null,null,null,null,null,null,null,"Above criteria met",null,{"$f":"IF(AND(Wst01_04=AIS_Yes,Wst01_02=AIS_Yes,Wst01_03=AIS_Yes,Wst01_05=AIS_Yes,Wst01_29=AIS_Yes,OR(Wst01_06=AIS_Yes,Wst01_06=AIS_NA)),AIS_Yes,AIS_No)","v":"No"}]
[]
[null,null,null,null,null,null,null,"Construction  waste sorted into ≥5 defined waste groups",null,"No"]
[]
[null,null,null,null,null,null,null,"National C&D waste recovery rate",null,"<40% (by weight)"]
[]
[null,null,null,null,null,null,null,"Non hazardous construction and demolition waste diverted from landfill"]
[]
[null,"Diversion of resources from landfill"]
[null,null,null,null,null,null,null,"Distribution of non hazardous waste",null,1,null,null,null,null,null,{"$f":"IF(J1031=\"\",\"Enter destination address of non hazardous waste leaving the site\",\"\")","v":""}]
[]
[null,null,null,null,null,null,null,"Level of waste diverted from landfill (in %, m3 per 100m2 or tonnes per 100m2)",null,null,null,"m3/100m2"]
[]
[null,null,null,null,null,"Total BREEAM credits achieved",null,{"$f":"IF(Wst_Preopt=Wst01_Preopt2,Wst01_Precredits,IF(ISERROR(Wst01_Tot_Err),0,Wst01_Tot_Err))","v":0}]
[]
[null,null,null,null,null,"Total contribution to overall building score",null,{"$f":"IF(Score_option=_PSc2,Wst01_27/Wst01_credits*Wst01_user,Wst01_27/Wst01_credits*Wst01_tot)","v":0}]
[]
[null,null,null,null,null,"Total BREEAM innovation credits achieved",null,{"$f":"IF(Wst_Preopt=Wst01_Preopt2,IF(Wst01_Precredits=3,Wst01_PreInnov,0),IF(ISERROR(Wst01_17_Err),0,Wst01_17_Err))","v":0}]
[]
[null,null,null,null,null,"Minimum standard(s) level",null,{"$f":"VLOOKUP(MinSt_13,AIS_MinSt_benchmarks,2,FALSE)","v":"Excellent"}]
[]
[null,"Comments/notes:"]
[]
[null,"Wst02 Recycled Aggregates"]
[]
[null,null,null,null,null,"No. of BREEAM credits available",null,1,null,null,null,null,null,"Available contribution to overall score",null,{"$f":"(BP_39/BP_07)*Wst02_credits","v":1.4999999999999999E-2}]
[]
[null,null,null,null,null,"No. of BREEAM innovation credits available",null,1,null,null,null,null,null,"Minimum standards applicable",null,"No"]
[null,"Assessment Criteria",null,null,null,null,null,null,null,"Total",null,"Credits available",null,"Credits achieved",null,"Shell & Core option?"]
[]
[null,null,null,null,null,null,null,"What is the target total % of high-grade aggregate that will be recycled/secondary aggregate?",null,"Please select",null,{"$f":"Mat05_credits","v":1},null,{"$f":"IF(OR(Wst02_01=wst02_preopt2,Wst02_01=wst02_preopt3),1,0)","v":0},null,"N/A",{"$f":"IF(ADAS0=ADAS01,AIS_statement59,\"\")","v":"Note: At the pre-assessment and design stage of assessment the percentages will most likely be based on targets, confirmed using  documentation that describes the intended source of the recycled/secondary aggregates and that the required amount (to achieve the quoted percentages) can be provided."}]
[]
[]
[]
[null,null,null,null,null,"Total BREEAM credits achieved",null,{"$f":"IF(OR(Wst02_01=wst02_preopt3,Wst02_01=wst02_preopt2),1,0)","v":0}]
[]
[null,null,null,null,null,"Total contribution to overall building score",null,{"$f":"IF(Score_option=_PSc2,(Wst02_14/Wst02_credits)*Wst02_user,(Wst02_14/Wst02_credits)*Wst02_tot)","v":0}]
[]
[null,null,null,null,null,"Total BREEAM innovation credits achieved",null,{"$f":"IF(Wst02_01=wst02_preopt3,1,0)","v":0}]
[]
[null,null,null,null,null,"Minimum standard(s) level",null,"N/A"]
[]
[null,"Comments/notes:"]
[]
[null,"Wst03 Operational Waste"]
[]
[null,null,null,null,null,"No. of BREEAM credits available",null,{"$f":"IF(ADBT0=ADBT8,2,1)","v":1},null,null,null,null,null,"Available contribution to overall score",null,{"$f":"(BP_39/BP_07)*Wst03_credits","v":1.4999999999999999E-2}]
[]
[null,null,null,null,null,"No. of BREEAM innovation credits available",null,0,null,null,null,null,null,"Minimum standards applicable",null,"Yes"]
[]
[]
[null,"03a - Assessment Criteria (Non- Residential)",null,null,null,null,null,null,null,"Compliant?",null,"Credits available",null,"Credits achieved",null,"Shell & Core option?"]
[]
[null,null,null,null,null,null,null,"Will appropriate facilities for the storage of operational recyclable waste volumes be provided?",null,"No",null,{"$f":"IF(ADBT0<>ADBT8,1,0)","v":1},null,{"$f":"IF(ADBT0<>ADBT8,IF(OR(Wst03_02=AIS_No,Wst03_02=\"\"),0,IF(AND(Wst03_02=AIS_Yes,OR(Wst03_03=AIS_Yes,Wst03_03=AIS_NA),OR(Wst03_04=AIS_Yes,Wst03_04=AIS_NA)),Wst03_06,IF(OR(Wst03_02=AIS_No,Wst03_03=AIS_No,Wst03_04=AIS_No),0,Wst03_06))),0)","v":0},null,"N/A"]
[null,null,null,null,null,null,null,"If relevant, will a static waste compactor(s) or baler(s) be specified/installed?",null,"No",null,null,null,null,null,null,{"$f":"IF(Wst03_02=AIS_No,\"\",AIS_statement60)","v":""}]
[null,null,null,null,null,null,null,"If relevant, will a vessel for composting suitable organic waste be specified/installed?",null,"No"]
[]
[]
[null,"03b - Assessment Criteria (Residential)",null,null,null,null,null,null,null,"Compliant?",null,"Credits available",null,"Credits achieved"]
[]
[null,null,null,null,null,null,null,"Will adequate external and internal storage space for recyclable and non-recyclable waste be provided?",null,"No",null,{"$f":"IF(ADBT0=ADBT8,1,0)","v":0},null,{"$f":"IF(AND(ADBT0=ADBT8,J1082=AIS_Yes),1,0)","v":0}]
[null,null,null,null,null,null,null,"Will adequate external and internal storage space for compostable waste be provided?",null,"No",null,{"$f":"IF(ADBT0=ADBT8,1,0)","v":0},null,{"$f":"IF(AND(ADBT0=ADBT8,J1083=AIS_Yes),1,0)","v":0}]
[]
[]
[null,null,null,null,null,"Total BREEAM credits achieved",null,{"$f":"Wst03_07+N1082+N1083","v":0}]
[]
[null,null,null,null,null,"Total contribution to overall building score",null,{"$f":"IF(Score_option=_PSc2,(Wst03_12/Wst03_credits)*Wst03_user,(Wst03_12/Wst03_credits)*Wst03_tot)","v":0}]
[]
[null,null,null,null,null,"Total BREEAM innovation credits achieved",null,"N/A"]
[]
[null,null,null,null,null,"Minimum standard(s) level",null,{"$f":"VLOOKUP(MinSt_14,AIS_MinSt_benchmarks,2,FALSE)","v":"Very Good"}]
[]
[null,"Comments/notes:"]
[]
[null,"Wst04 Speculative Floor and Ceiling Finishes",null,null,null,null,null,null,null,null,null,null,null,null,null,{"$f":"IF(ADBT0=ADBT1,\"\",AIS_statement32)","v":"Assessment Issue Not Applicable"}]
[null,null,null,null,null,null,null,{"$f":"IF(Wst04_credits=AIS_NA,0,Wst04_credits)","v":0}]
[null,null,null,null,null,"No. of BREEAM credits available",null,{"$f":"IF(Wst04_01=AIS_statement32,AIS_NA,1)","v":"N/A"},null,null,null,null,null,"Available contribution to overall score",null,{"$f":"IF(Wst04_01=AIS_statement32,AIS_NA,(BP_39/BP_07)*Wst04_credits)","v":"N/A"},{"$f":"IF(Wst04_01=AIS_statement32,AIS_statement61,\"\")","v":"Note: This assessment issue is applicable to office buildings only."}]
[]
[null,null,null,null,null,"No. of BREEAM innovation credits available",null,{"$f":"IF(Wst04_01=AIS_statement32,AIS_NA,0)","v":"N/A"},null,null,null,null,null,"Minimum standards applicable",null,{"$f":"IF(Wst04_01=AIS_statement32,AIS_NA,AIS_No)","v":"N/A"}]
[null,"Assessment Criteria",null,null,null,null,null,null,null,"Compliant?",null,"Credits available",null,"Credits achieved",null,"Shell & Core option?"]
[]
[null,"Please select",null,null,null,null,null,null,null,{"$f":"IF(OR(Wst04_03=Wst04_option00,Wst04_03=Wst04_option07),AIS_No,AIS_Yes)","v":"No"},null,{"$f":"Wst04_credits","v":"N/A"},null,{"$f":"IF(Wst04_04=AIS_No,0,IF(Wst04_04=AIS_Yes,Wst04_05))","v":0},null,"N/A","Note: It is not necessary to define a shell and core option for this issue as the selection made opposite negates it."]
[]
[null,null,null,null,null,"Total BREEAM credits achieved",null,{"$f":"IF(ISERROR(Wst04_Tot_Err),0,Wst04_Tot_Err)","v":"N/A"}]
[]
[null,null,null,null,null,"Total contribution to overall building score",null,{"$f":"IF(Wst04_01=AIS_statement32,AIS_NA,IF(Score_option=_PSc2,Wst04_08/Wst04_credits*Wst04_user,Wst04_08/Wst04_credits*Wst04_tot))","v":"N/A"}]
[]
[null,null,null,null,null,"Total BREEAM innovation credits achieved",null,"N/A"]
[]
[null,null,null,null,null,"Minimum standard(s) level",null,"N/A"]
[]
[null,"Comments/notes:"]
[]
[]
[null,"LAND USE & ECOLOGY"]
[]
[null,"LE01 Site Selection"]
[]
[null,null,null,null,null,"No. of BREEAM credits available",null,3,null,null,null,null,null,"Available contribution to overall score",null,{"$f":"(BP_40/BP_08)*LE01_credits","v":0.03}]
[]
[null,null,null,null,null,"No. of BREEAM innovation credits available",null,0,null,null,null,null,null,"Minimum standards applicable",null,"No"]
[null,"Assessment Criteria",null,null,null,null,null,null,null,"Percentage",null,"Credits available",null,"Credits achieved",null,"Shell & Core option?"]
[]
[null,null,null,null,null,null,null,"What percentage of proposed development footprint will be on previously developed land?",null,"Please select",null,2,null,{"$f":"IF(LE01_01=LE01_preopt3,2,IF(LE01_01=LE01_preopt2,1,0))","v":0},null,"N/A"]
[null,null,null,null,null,null,null,null,null,"Compliant?"]
[null,null,null,null,null,null,null,"Is the site deemed to be significantly contaminated?",null,"No",null,"N/A",null,"N/A",null,"N/A"]
[null,null,null,null,null,null,null,"Will remediation of the site be carried out?",null,"No",null,1,null,{"$f":"IF(AND(LE01_02=AIS_Yes,LE01_09=AIS_Yes),LE01_04,0)","v":0},null,"N/A"]
[]
[null,null,null,null,null,"Total BREEAM credits achieved",null,{"$f":"IF(ISERROR(LE01_05+LE01_06),0,LE01_05+LE01_06)","v":0}]
[]
[null,null,null,null,null,"Total contribution to overall building score",null,{"$f":"IF(Score_option=_PSc2,LE01_07/LE01_credits*LE01_user,LE01_07/LE01_credits*LE01_tot)","v":0}]
[]
[null,null,null,null,null,"Total BREEAM innovation credits achieved",null,"N/A"]
[]
[null,null,null,null,null,"Minimum standard(s) level",null,"N/A"]
[]
[null,"Comments/notes:"]
[]
[null,"LE02 Ecological Value of Site and Protection of Ecological Features"]
[]
[null,null,null,null,null,"No. of BREEAM credits available",null,2,null,null,null,null,null,"Available contribution to overall score",null,{"$f":"(BP_40/BP_08)*LE02_credits","v":0.02}]
[]
[null,null,null,null,null,"No. of BREEAM innovation credits available",null,0,null,null,null,null,null,"Minimum standards applicable",null,"No"]
[]
[null,null,null,null,null,null,null,"How will the ecological value of the land be defined?",null,"The BREEAM checklist"]
[null,"Assessment Criteria",null,null,null,null,null,null,null,"Compliant?",null,"Credits available",null,"Credits achieved",null,"Shell & Core option?"]
[]
[null,null,null,null,null,null,null,"Can the land within the construction zone be defined as ‘land of low ecological value’?",null,"No",null,1,null,{"$f":"IF(LE02_03=AIS_Yes,1,0)","v":0},null,"N/A"]
[null,null,null,null,null,null,null,"Will all features of ecological value surrounding the construction zone/site boundary be protected?",null,"No",null,1,null,{"$f":"IF(LE02_04=AIS_Yes,1,0)","v":0},null,"N/A"]
[]
[null,null,null,null,null,"Total BREEAM credits achieved",null,{"$f":"SUM(N1149:N1150)","v":0}]
[]
[null,null,null,null,null,"Total contribution to overall building score",null,{"$f":"IF(Score_option=_PSc2,LE02_07/LE02_credits*LE02_user,LE02_07/LE02_credits*LE02_tot)","v":0}]
[]
[null,null,null,null,null,"Total BREEAM innovation credits achieved",null,"N/A"]
[]
[null,null,null,null,null,"Minimum standard(s) level",null,"N/A"]
[]
[null,"Comments/notes:"]
[]
[null,"LE04 Enhancing Site Ecology"]
[]
[null,null,null,null,null,"No. of BREEAM credits available",null,3,null,null,null,null,null,"Available contribution to overall score",null,{"$f":"(BP_40/BP_08)*LE04_credits","v":0.03}]
[]
[null,null,null,null,null,"No. of BREEAM innovation credits available",null,0,null,null,null,null,null,"Minimum standards applicable",null,"No"]
[null,"Assessment Criteria",null,null,null,null,null,null,null,"Compliant?",null,"Credits available",null,"Credits achieved",null,"Shell & Core option?"]
[]
[null,null,null,null,null,null,null,"Will a Suitably Qualified Ecologist be appointed to report on enhancing site ecology?",null,"No",null,{"$f":"LE04_credits","v":3},null,{"$f":"IF(OR(LE04_02<>AIS_Yes,LE04_03<>AIS_Yes),0,IF(LE04_04>=LE04_preopt0,0,IF(LE04_04>=LE04_preopt3,3,IF(LE04_04>=LE04_preopt2,2,IF(LE04_04>=LE04_preopt1,1,0)))))","v":0},null,"N/A"]
[null,null,null,null,null,null,null,"Will all recommendations in ecology report for protection of site ecology implemented?",null,"No"]
[null,null,null,null,null,null,null,"What percentage of recommendtations for enhancement of site ecology will be implemented?",null,"Please select"]
[]
[null,null,null,null,null,"Total BREEAM credits achieved",null,{"$f":"IF(ISERROR(LE04_06),0,LE04_06)","v":0}]
[]
[null,null,null,null,null,"Total contribution to overall building score",null,{"$f":"IF(Score_option=_PSc2,(LE04_13/LE04_credits)*LE04_user,(LE04_13/LE04_credits)*LE04_tot)","v":0}]
[]
[null,null,null,null,null,"Total BREEAM innovation credits achieved",null,"N/A"]
[]
[null,null,null,null,null,"Minimum standard(s) level",null,"N/A"]
[]
[null,"Comments/notes:"]
[]
[null,"LE05 Long Term Impact on Biodiversity"]
[]
[null,null,null,null,null,"No. of BREEAM credits available",null,2,null,null,null,null,null,"Available contribution to overall score",null,{"$f":"(BP_40/BP_08)*LE05_credits","v":0.02}]
[]
[null,null,null,null,null,"No. of BREEAM innovation credits available",null,0,null,null,null,null,null,"Minimum standards applicable",null,"No"]
[null,"Assessment Criteria",null,null,null,null,null,null,null,"Compliant?",null,"Credits available",null,"Credits achieved",null,"Shell & Core option?"]
[]
[null,null,null,null,null,null,null,"Will the project meet the pre-requisite criteria for this issue?",null,"No",null,{"$f":"LE05_credits","v":2},null,{"$f":"IF(LE05_02=AIS_No,0,LE05_16)","v":0},null,"N/A",{"$f":"IF(LE05_11=0,AIS_statement70,\"\")","v":""}]
[null,null,null,null,null,null,null,"Will a Biodiversity Champion be appointed to monitor/minimise impacts of site activities on biodiversity?",null,"No"]
[null,null,null,null,null,null,null,"Will the contractor provide training for the site workforce on how to protect ecology during the project?",null,"No"]
[null,null,null,null,null,null,null,"Will the contractor record actions to protect biodiversity & monitor effectiveness during construction?",null,"No"]
[null,null,null,null,null,null,null,"Will a new ecologically valuable habitat, appropriate to the local area, be created?",null,"No"]
[null,null,null,null,null,null,null,"Will the contractor programme site works to minimise disturbance to wildlife?",null,"No"]
[null,"Will a local wildlife group partnership be established?",null,null,null,null,null,null,null,"No"]
[]
[null,null,null,null,null,"Total BREEAM credits achieved",null,{"$f":"IF(ISERROR(LE05_10),0,LE05_10)","v":0}]
[]
[null,null,null,null,null,"Total contribution to overall building score",null,{"$f":"IF(Score_option=_PSc2,(LE05_14/LE05_credits)*LE05_user,(LE05_14/LE05_credits)*LE05_tot)","v":0}]
[]
[null,null,null,null,null,"Total BREEAM innovation credits achieved",null,"N/A"]
[]
[null,null,null,null,null,"Minimum standard(s) level",null,"N/A"]
[]
[null,"Comments/notes:"]
[]
[]
[]
[null,"LE06 Building Footprint (Residential Only)"]
[null,null,null,null,null,null,null,{"$f":"IF(LE06_credits=AIS_NA,0,LE06_credits)","v":0}]
[null,null,null,null,null,"No. of BREEAM credits available",null,{"$f":"IF(ADBT0=ADBT8,2,AIS_NA)","v":"N/A"},null,null,null,null,null,"Available contribution to overall score",null,{"$f":"(BP_40/BP_08)*LE01_credits","v":0.03}]
[]
[null,null,null,null,null,"No. of BREEAM innovation credits available",null,0,null,null,null,null,null,"Minimum standards applicable",null,"No"]
[null,"Assessment Criteria",null,null,null,null,null,null,null,null,null,null,null,null,null,"Shell & Core option?"]
[]
[null,null,null,null,null,null,null,"What is the residential building type?",null,null,null,null,null,null,null,"N/A"]
[null,null,null,null,null,null,null,null,null,"Ratio",null,"Credits available",null,"Credits achieved"]
[null,null,null,null,null,null,null,"What is the ratio of gross internal floor area : Gross internal Ground floor area?",null,null,null,{"$f":"H1212","v":"N/A"},null,{"$f":"IF(ADBT0<>ADBT8,0,IF(LE6_ratio=Le06_0credits,0,IF(LE6_ratio=LE06_1credit,1,IF(LE6_ratio=LE06_2credits,2))))","v":0}]
[]
[null,null,null,null,null,"Total BREEAM credits achieved",null,{"$f":"N1219","v":0}]
[]
[null,null,null,null,null,"Total contribution to overall building score",null,{"$f":"IF(LE06_creditsNA=0,0,IF(Score_option=_PSc2,P1212/LE06_credits*LE06_user,P1212/LE06_credits*LE06_tot))","v":0}]
[]
[null,null,null,null,null,"Total BREEAM innovation credits achieved",null,"N/A"]
[]
[null,null,null,null,null,"Minimum standard(s) level",null,"N/A"]
[]
[null,"Comments/notes:"]
[]
[]
[]
[null,"POLLUTION"]
[]
[null,"Pol01 Impact of Refrigerants",null,null,null,null,null,null,null,null,null,null,null,null,null,{"$f":"IF(AND(ADBT0=ADBT2,ADIND_option03=AD_no,ADIND_option03=AD_no),AIS_statement32,\"\")","v":""}]
[null,null,null,null,null,null,null,{"$f":"IF(Pol01_credits=AIS_NA,0,Pol01_credits)","v":4}]
[null,null,null,null,null,"No. of BREEAM credits available",null,{"$f":"IF(Pol01_01=AIS_statement32,AIS_NA,3+L1243)","v":4},null,null,null,null,null,"Available contribution to overall score",null,{"$f":"IF(ISERROR(IF(Pol01_01=AIS_statement32,AIS_NA,(BP_41/BP_09)*Pol01_credits)),\"\",IF(Pol01_01=AIS_statement32,AIS_NA,(BP_41/BP_09)*Pol01_credits))","v":2.8444444444444446E-2},{"$f":"IF(Pol01_01=AIS_statement32,AIS_statement72,AIS_statement75)","v":"Note: The data required for this assessment issue is sourced from the separate BREEAM Pol 01 calculator."}]
[]
[null,null,null,null,null,"No. of BREEAM innovation credits available",null,{"$f":"IF(Pol01_01=AIS_statement32,AIS_NA,0)","v":0},null,null,null,null,null,"Minimum standards applicable",null,{"$f":"IF(Pol01_01=AIS_statement32,AIS_NA,AIS_No)","v":"No"}]
[null,"Assessment Criteria",null,null,null,null,null,null,null,null,null,"Credits available",null,"Credits achieved",null,"Shell & Core option?"]
[]
[null,null,null,null,null,null,null,"Will refrigerant containing systems be installed in the building?",null,"Yes",null,{"$f":"IF(Pol01_02=AIS_No,Pol01_credits,0)","v":0},null,{"$f":"IF(OR(ADPT=ADPT01,ADPT=ADPT03),Pol01_17,IF(OR(Pol01_05=AIS_option00,Pol01_05=AIS_option01,Pol01_05=AIS_option03,Pol01_05=AIS_option05),Pol01_17,IF(Pol01_05=AIS_option02,Pol01_17*0.5,0)))","v":0},null,"N/A",{"$f":"IF(Pol01_01=AIS_statement32,\"\",IF(OR(ADPT=ADPT02,ADPT=ADPT04),AIS_statement71,\"\"))","v":""}]
[null,null,null,null,null,null,null,"Will the refrigerants have an Ozone Depleting Potential (ODP) of zero?",null,"No",null,{"$f":"IF(AD_Ozoneleg=AIS_Yes,0,1)","v":1},null,{"$f":"IF(AD_Ozoneleg=AIS_Yes,0,IF(AND((J1243=AIS_Yes),(P1243=\"Option 2\")),0.5,IF(AND((J1243=AIS_Yes),(P1243=\"Option 1\")),1,IF(AND((J1243=AIS_Yes),(P1243=\"Option 3\")),1,IF(AND((J1243=AIS_Yes),(P1243=\"N/A\")),1,0)))))","v":0},null,"N/A"]
[null,null,null,null,null,null,null,"Will the specified refrigerant(s) have a Global Warming Potential of 10 or less?",null,"No",null,{"$f":"IF(Pol01_02=AIS_No,0,2)","v":2},null,{"$f":"IF(OR(ADPT=ADPT01,ADPT=ADPT03),Pol01_22,IF(OR(Pol01_05=AIS_option00,Pol01_05=AIS_option01,Pol01_05=AIS_option03,Pol01_05=AIS_option05),Pol01_22,IF(Pol01_05=AIS_option02,Pol01_22*0.5,0)))","v":0}]
[null,null,null,null,null,null,null,"What is the target range Direct Effect Life Cycle CO2eq. emissions for the system?",null,null,null,{"$f":"IF(Pol01_01=AIS_statement32,\"\",AIS_units24)","v":"kgCO2eq/kW coolth capacity"}]
[null,null,null,null,null,null,null,"What will the Cooling/heating capacity of the system be?",null,null,null,{"$f":"IF(Pol01_01=AIS_statement32,\"\",AIS_units25)","v":"kW"}]
[null,null,null,null,null,null,null,"Will a refrigerant leak detection and containment system be specified/installed?",null,"No",null,{"$f":"IF(Pol01_02=AIS_No,0,1)","v":1},null,{"$f":"IF(AND(Pol01_08=AIS_Yes,OR(Pol01_18=AIS_option00,Pol01_18=AIS_option01,Pol01_18=AIS_option03,Pol01_18=AIS_option05)),Pol01_09,IF(AND(Pol01_08=AIS_Yes,Pol01_18=AIS_option02),Pol01_09*0.5,IF(Pol01_08=AIS_Yes,Pol01_09,0)))","v":0},null,"N/A"]
[]
[null,null,null,null,null,"Total BREEAM credits achieved",null,{"$f":"IF(ISERROR(Pol01_Tot_Err),0,Pol01_Tot_Err)","v":0}]
[]
[null,null,null,null,null,"Total contribution to overall building score",null,{"$f":"IF(ISERROR(IF(Pol01_01=AIS_statement32,AIS_NA,(Pol01_19/Pol01_credits)*Pol01_tot)),\"\",IF(Pol01_01=AIS_statement32,AIS_NA,IF(Score_option=_PSc2,Pol01_19/Pol01_credits*Pol01_user,(Pol01_19/Pol01_credits*Pol01_tot))))","v":0}]
[]
[null,null,null,null,null,"Total BREEAM innovation credits achieved",null,"N/A"]
[]
[null,null,null,null,null,"Minimum standard(s) level",null,"N/A"]
[]
[null,"Comments/notes:"]
[]
[null,"Pol02 NOx Emissions",null,null,null,null,null,null,null,null,null,null,null,null,null,{"$f":"IF(Pol02_credits=AIS_NA,AIS_statement32,\"\")","v":""},{"$f":"IF(Pol02_24=AIS_statement32,\"\",AIS_Statement104)","v":"Note: Credits for this issue are determined on the basis of NOx emissions from space and water heating systems. However, where cooling is specified information on the performance of the cooling system is required for the purposes of reporting and benchmarking."}]
[]
[null,null,null,null,null,"No. of BREEAM credits available",null,3,null,null,null,null,null,"Available contribution to overall score",null,{"$f":"IF(ISERROR(IF(Pol02_24=AIS_statement32,AIS_NA,(BP_41/BP_09)*Pol02_credits)),\"\",IF(Pol02_24=AIS_statement32,AIS_NA,(BP_41/BP_09)*Pol02_credits))","v":2.1333333333333336E-2}]
[]
[null,null,null,null,null,"No. of BREEAM innovation credits available",null,1,null,null,null,null,null,"Minimum standards applicable",null,{"$f":"IF(Pol02_24=AIS_statement32,AIS_NA,AIS_No)","v":"No"},{"$f":"IF(Pol02_24=AIS_statement32,\"\",AIS_Statement103)","v":"Instruction: If the building has not specified mechanical cooling then insert zero in the 'NOx emission level - cooling' box. If cooling is, or will be specified then enter the NOx emissions level for the system. If heating and cooling is provided by the same system then pro-rata the overall NOx emissions according to modelled heating/cooling demand in the building and enter the relevant values in each box."}]
[null,"Assessment Criteria",null,null,null,null,null,null,null,null,null,null,null,null,null,"Shell & Core option?"]
[]
[null,null,null,null,null,null,null,"Please enter the target/maximum dry NOx emission level for the space heating system:",null,null,null,{"$f":"IF(Pol02_24=AIS_statement32,\"\",AIS_units27)","v":"mg/kWh"},null,null,null,"N/A"]
[null,null,null,null,null,null,null,"Dry NOx emission level - cooling",null,"anything",null,{"$f":"IF(Pol02_24=AIS_statement32,\"\",AIS_units27)","v":"mg/kWh"}]
[null,null,null,null,null,null,null,"Please enter the target/maximum dry NOx emission level for the water heating system:",null,null,null,{"$f":"IF(Pol02_24=AIS_statement32,\"\",AIS_units27)","v":"mg/kWh"}]
[null,null,null,null,null,null,null,"Please select the Nominal Heat input for the heating plant:",null,null,null,"kW"]
[null,null,null,null,null,null,null,"Energy consumption: heating only or heating and cooling (as appropriate)",null,"anything",null,{"$f":"IF(Pol02_24=AIS_statement32,\"\",AIS_units28)","v":"kWh/m2/yr"}]
[null,null,null,null,null,null,null,"Inside Europe only: Enter the Boiler class if applicable (EN 297:1994 & EN 483:1999):"]
[null,null,null,null,null,null,null,null,null,null,null,null,null,null,null,null,{"$f":"IF(Pol02_24=AIS_statement32,\"\",AIS_statement76)","v":"Note: The energy consumption for heating or heating and cooling (where cooling specified) is sourced from the approved software's Building Regulations Output Document  (technical data sheet). This information is used to report the KPI for total NOx emissions, it is not required to award the available BREEAM credits (insert \"INA\" if not known)."}]
[null,null,null,null,null,"Total BREEAM credits achieved",null,{"$f":"IF(Pol02_23=\"Option 1\",$J$1273,IF(Pol02_23=\"Option 2\",$J$1273*0.5,IF(Pol02_23=\"Option 3\",$J$1273,IF(Pol02_23=\"Option 4\",0,IF(Pol02_23=\"N/A\",$J$1273,0)))))","v":0},null,{"$f":"IF(OR(Pol02_20=\"\",Pol02_21=\"\",Pol01_KPI02=\"\",Pol02_29=\"\"),0,Pol02_Score_Val)","v":0}]
[]
[null,null,null,null,null,"Total contribution to overall building score",null,{"$f":"IF(ISERROR(IF(Pol02_24=AIS_statement32,AIS_NA,(Pol02_26/Pol02_credits)*Pol02_tot)),\"\",IF(Pol02_24=AIS_statement32,AIS_NA,IF(Score_option=_PSc2,Pol02_26/Pol02_credits*Pol02_user,(Pol02_26/Pol02_credits)*Pol02_tot)))","v":0}]
[]
[null,null,null,null,null,"Total BREEAM innovation credits achieved",null,"N/A"]
[]
[null,null,null,null,null,"Minimum standard(s) level",null,"N/A"]
[]
[null,"Comments/notes:"]
[]
[null,"Pol03 Surface Water Run off"]
[]
[null,null,null,null,null,"No. of BREEAM credits available",null,5,null,null,null,null,null,"Available contribution to overall score",null,{"$f":"IF(ISERROR((BP_41a/BP_09b)*Pol03_credits),\"\",(BP_41a/BP_09b)*Pol03_credits)","v":3.5999999999999997E-2}]
[]
[null,null,null,null,null,"No. of BREEAM innovation credits available",null,0,null,null,null,null,null,"Minimum standards applicable",null,"No"]
[null,"Assessment Criteria",null,null,null,null,null,null,null,"Compliant?",null,"Credits available",null,"Credits achieved",null,"Shell & Core option?"]
[]
[null,null,null,null,null,null,null,"What is the actual/likely annual probability of flooding for the assessed site?",null,"Please select",null,2,null,{"$f":"IF(AND(Pol03_02=AIS_Yes,Pol03_01=Pol03_option01),Pol03_06,IF(AND(Pol03_02=AIS_Yes,OR(Pol03_01=Pol03_option02,Pol03_01=Pol03_option03)),1,0))","v":0},null,"N/A"]
[null,null,null,null,null,null,null,{"$f":"IF(Pol03_01=Pol03_option01,AIS_statement65,AIS_statement66)","v":"Will a Flood Risk Assessment be undertaken and ground level of the building/access meet BREEAM criteria?"},null,"No",null,null,null,null,null,"N/A"]
[null,null,null,null,null,null,null,"Will the site meet the BREEAM criteria for peak rate surface water run off?",null,"No",null,1,null,{"$f":"IF(Pol03_03=AIS_Yes,Pol03_07,0)","v":0},null,"N/A"]
[null,null,null,null,null,null,null,"Will the site meet the criteria for surface water run off volume, attenuation and/or limiting discharge?",null,"No",null,1,null,{"$f":"IF(Pol03_04=AIS_Yes,Pol03_08,0)","v":0},null,"N/A"]
[null,null,null,null,null,null,null,"Will the site be designed to minimise watercourse pollution in accordance with the BREEAM criteria?",null,"No",null,1,null,{"$f":"IF(Pol03_05=AIS_Yes,Pol03_09,0)","v":0},null,"N/A"]
[]
[null,null,null,null,null,"Total BREEAM credits achieved",null,{"$f":"IF(ISERROR(Pol03_Tot_Err),0,Pol03_Tot_Err)","v":0}]
[]
[null,null,null,null,null,"Total contribution to overall building score",null,{"$f":"IF(ISERROR((Pol03_14/Pol03_credits)*Pol03_tot),\"\",IF(Score_option=_PSc2,Pol03_14/Pol03_credits*Pol03_user,Pol03_14/Pol03_credits*Pol03_tot))","v":0}]
[]
[null,null,null,null,null,"Total BREEAM innovation credits achieved",null,"N/A"]
[]
[null,null,null,null,null,"Minimum standard(s) level",null,"N/A"]
[]
[null,"Comments/notes:"]
[]
[null,"Pol04 Reduction of Night Time Light Pollution"]
[]
[null,null,null,null,null,"No. of BREEAM credits available",null,1,null,null,null,null,null,"Available contribution to overall score",null,{"$f":"IF(ISERROR((BP_41/BP_09)*Pol04_credits),\"\",(BP_41/BP_09)*Pol04_credits)","v":7.1111111111111115E-3}]
[]
[null,null,null,null,null,"No. of BREEAM innovation credits available",null,0,null,null,null,null,null,"Minimum standards applicable",null,"No"]
[null,"Assessment Criteria",null,null,null,null,null,null,null,"Compliant?",null,"Credits available",null,"Credits achieved",null,"Shell & Core option?"]
[]
[null,null,null,null,null,null,null,"Will the external lighting be designed to reduce light pollution?",null,"No",null,{"$f":"Pol04_credits","v":1},null,{"$f":"IF(AND(Pol04_01=AIS_Yes,OR(Pol04_04=AIS_option00,Pol04_04=AIS_option01,Pol04_04=AIS_option03,Pol04_04=AIS_option05)),Pol04_02,IF(AND(Pol04_01=AIS_Yes,Pol04_04=AIS_option02),Pol04_02*0.5,0))","v":0},null,"N/A"]
[]
[null,null,null,null,null,"Total BREEAM credits achieved",null,{"$f":"IF(ISERROR(Pol04_03),0,Pol04_03)","v":0}]
[]
[null,null,null,null,null,"Total contribution to overall building score",null,{"$f":"IF(ISERROR((Pol04_05/Pol04_credits)*Pol04_tot),\"\",IF(Score_option=_PSc2,Pol04_05/Pol04_credits*Pol04_user,Pol04_05/Pol04_credits*Pol04_tot))","v":0}]
[]
[null,null,null,null,null,"Total BREEAM innovation credits achieved",null,"N/A"]
[]
[null,null,null,null,null,"Minimum standard(s) level",null,"N/A"]
[]
[null,"Comments/notes:"]
[]
[null,"Pol05 Noise Attenuation",null,null,null,null,null,null,null,null,null,null,null,null,null,{"$f":"IF(AND(AD_heat=AD_none,AD_cool=AD_none),AIS_statement32,\"\")","v":""}]
[null,null,null,null,null,null,null,{"$f":"IF(Pol05_credits=AIS_NA,0,Pol05_credits)","v":1}]
[null,null,null,null,null,"No. of BREEAM credits available",null,{"$f":"IF(ADBT0=ADBT8,AIS_NA,IF(Pol05_09=AIS_statement32,AIS_NA,1))","v":1},null,null,null,null,null,"Available contribution to overall score",null,{"$f":"IF(ISERROR(IF(Pol05_09=AIS_statement32,AIS_NA,(BP_41/BP_09)*Pol05_credits)),\"\",IF(Pol05_09=AIS_statement32,AIS_NA,(BP_41/BP_09)*Pol05_credits))","v":7.1111111111111115E-3}]
[]
[null,null,null,null,null,"No. of BREEAM innovation credits available",null,{"$f":"IF(Pol05_09=AIS_statement32,AIS_NA,0)","v":0},null,null,null,null,null,"Minimum standards applicable",null,{"$f":"IF(Pol05_09=AIS_statement32,AIS_NA,AIS_No)","v":"No"}]
[null,"Assessment Criteria",null,null,null,null,null,null,null,{"$f":"IF(Pol05_02=AIS_No,\"\",\"Compliant\")","v":"Compliant"},null,"Credits available",null,"Credits achieved",null,"Shell & Core option?"]
[]
[null,null,null,null,null,null,null,"Will there be, or are there noise-sensitive areas/buildings within 800m radius of the development?",null,"Yes",null,{"$f":"Pol05_credits","v":1},null,{"$f":"IF(Pol05_02=AIS_No,Pol05_04,IF(AND(Pol05_02=AIS_Yes,Pol05_03=AIS_No),0,IF(AND(Pol05_02=AIS_Yes,Pol05_03=AIS_Yes,OR(Pol05_07=AIS_option00,Pol05_07=AIS_option01,Pol05_07=AIS_option03,Pol05_07=AIS_option05)),Pol05_04,IF(AND(Pol05_02=AIS_Yes,Pol05_03=AIS_Yes,Pol05_07=AIS_option02),Pol05_04*0.5,0))))","v":0}]
[null,null,null,null,null,null,null,"Will a noise impact assessment be completed and, if applicable, noise attenuation measures specified?",null,"No",null,null,null,null,null,"N/A"]
[]
[null,null,null,null,null,"Total BREEAM credits achieved",null,{"$f":"IF(ISERROR(Pol05_Tot_Err),0,Pol05_Tot_Err)","v":0}]
[]
[null,null,null,null,null,"Total contribution to overall building score",null,{"$f":"IF(Pol05_credits=\"N/A\",\"N/A\",IF(ISERROR(IF(Pol05_09=AIS_statement32,AIS_NA,(Pol05_10/Pol05_credits)*Pol05_tot)),\"\",IF(Pol05_09=AIS_statement32,AIS_NA,IF(Score_option=_PSc2,Pol05_10/Pol05_credits*Pol05_user,Pol05_10/Pol05_credits*Pol05_tot))))","v":0}]
[]
[null,null,null,null,null,"Total BREEAM innovation credits achieved",null,"N/A"]
[]
[null,null,null,null,null,"Minimum standard(s) level",null,"N/A"]
[]
[null,"Comments/notes:"]
[]
[]
[]
[]
[]
[]
[null,"INNOVATION"]
[]
[null,"Inn01 Innovation"]
[]
[null,null,null,null,null,"No. of BREEAM innovation credits available",null,10,null,null,null,null,null,"Available contribution to overall score",null,{"$f":"(BP_42/BP_10)*Inn01_credits","v":0.1}]
[]
[null,null,null,null,null,null,null,null,null,null,null,null,null,"Minimum standards applicable",null,"No"]
[null,"Assessment Criteria",null,null,null,null,null,null,null,"Compliant?",null,"Credits available",null,"Credits achieved"]
[]
[null,null,null,null,null,null,null,{"$f":"B18","v":"Man01 Sustainable Procurement"},null,{"$f":"Man01_09","v":"No"},null,{"$f":"Man01_18","v":1},null,{"$f":"Man01_Exemp","v":0}]
[null,null,null,null,null,null,null,{"$f":"B47","v":"Man02 Responsible Construction Practices"},null,{"$f":"IF(Man02_Exempl>0,AIS_Yes,AIS_No)","v":"No"},null,{"$f":"Man02_02","v":1},null,{"$f":"Man02_Exempl","v":0}]
[null,null,null,null,null,null,null,{"$f":"B191","v":"Hea02 Indoor Air Quality"},null,{"$f":"J208","v":"No"},null,{"$f":"Hea02_Ex_Avail","v":2},null,{"$f":"H219","v":0}]
[null,null,null,null,null,null,null,{"$f":"B365","v":"Ene01 Energy Efficiency "},null,{"$f":"IF(OR(Ene01_37=AIS_Yes,Ene01_36>=AK1616),AIS_Yes,AIS_No)","v":"No"},null,{"$f":"Ene01_39","v":5},null,{"$f":"Ene01_27","v":0}]
[null,null,null,null,null,null,null,{"$f":"Tra_03","v":"Tra03  Alternative modes of transport "},null,{"$f":"IF(H703=1,AIS_Yes,AIS_No)","v":"No"},null,1,null,{"$f":"H703","v":0}]
[null,null,null,null,null,null,null,{"$f":"B781","v":"Wat01 Water Consumption"},null,{"$f":"IF(Wat01_08=0,AIS_No,AIS_Yes)","v":"No"},null,{"$f":"Wat01_00","v":1},null,{"$f":"Wat01_08","v":0}]
[null,null,null,null,null,null,null,"Mat01 Life Cycle Impacts",null,{"$f":"IF(OR(Mat01_07=AIS_No,Mat01_07=\"\"),AIS_No,IF(Mat01_07=AIS_Yes,AIS_Yes))","v":"No"},null,{"$f":"Mat01_02","v":1},null,{"$f":"Mat01_08","v":0}]
[null,null,null,null,null,null,null,"Mat03 Responsible Sourcing of Materials",null,{"$f":"IF(Mat03_35>0,AIS_Yes,AIS_No)","v":"No"},null,{"$f":"Mat03_02","v":1},null,{"$f":"Mat03_35","v":0}]
[null,null,null,null,null,null,null,"Wst01 Construction Waste Management",null,{"$f":"IF(Wst01_17=1,AIS_Yes,AIS_No)","v":"No"},null,{"$f":"H1005","v":1},null,{"$f":"Wst01_17","v":0}]
[null,null,null,null,null,null,null,"Wst02 Recycled Aggregates",null,{"$f":"IF(Wst02_11>0,AIS_Yes,AIS_No)","v":"No"},null,{"$f":"Wst02_13","v":1},null,{"$f":"Wst02_11","v":0}]
[]
[null,null,null,null,null,null,null,null,null,null,null,"Number of 'approved' innovation credits achieved?",null,null,null,null,{"$f":"IF(Inn01_01>0,AIS_statement11,\"\")","v":""}]
[]
[null,null,null,null,null,"Total BREEAM innovation credits achieved",null,{"$f":"IF(ISERROR(Inn01_Tot_Err),0,Inn01_Tot_Err)","v":0},null,null,null,null,null,null,null,null,{"$f":"IF(SUM(N1359:N1370)>10,AIS_statement10,\"\")","v":""}]
[]
[null,null,null,null,null,"Total contribution to overall building score",null,{"$f":"IF(Score_option=_PSc2,(Inn01_02/Inn01_credits)*Innov_user,(Inn01_02/Inn01_credits)*Inn01_tot)","v":0}]
[]
[null,null,null,null,null,"Minimum standard(s) level",null,"N/A"]
[]
[null,"Comments/notes:"]
[]
[]
[]
[]
[null,null,null,null,null,null,null,null,null,null,null,null,null,null,null,null,null,null,null,null,null,null,null,"Options",null,"Drop-down %",null,"Units",null,"Project type",null,null,"Minimum standards verifier",null,null,null,null,null,null,null,null,null,"Shell only options",null,"Credit numbers"]
[null,null,null,null,null,null,null,null,null,null,null,null,null,null,null,null,null,null,null,null,null,null,null,"Please select",null,"N/A",null,"kWh",null,{"$f":"ADAS0","v":"Pre-assessment"},null,5,"Outstanding","Outstanding",null,"Pass \n(level 1)","Good\n(level 2)","VG\n(level 3)","Exc\nLevel 4)","Outs\n(level 5","Level \nachieved",null,null,null,0]
[null,null,null,null,null,null,null,null,null,null,null,null,null,null,null,null,null,null,null,null,null,null,null,"Yes",null,0,null,"kWh/10% project value",null,{"$f":"ADAS01","v":"Pre-assessment"},null,4,"Excellent","Excellent","Man01",{"$f":"IF(OR(ADPT=ADPT02,ADPT=ADPT04),0.5,1)","v":1},{"$f":"IF(OR(ADPT=ADPT02,ADPT=ADPT04),0.5,1)","v":1},{"$f":"IF(OR(ADPT=ADPT02,ADPT=ADPT04),0.5,1)","v":1},{"$f":"IF(OR(ADPT=ADPT02,ADPT=ADPT04),0.5,1)","v":1},{"$f":"IF(OR(ADPT=ADPT02,ADPT=ADPT04),1,2)","v":2},{"$f":"IF(Score_option=_PSc2,IF(Man01_user=$AM$1385,Min_Ex_Ref,IF(Man01_user=$AN$1385,Min_Out_Ref,IF(Man01_user>$AN$1385,Min_Out_Ref,Min_No_Ref))),IF(Man01_Tot=$AM$1385,Min_Ex_Ref,IF(Man01_Tot=$AN$1385,Min_Out_Ref,IF(Man01_Tot>$AN$1385,Min_Out_Ref,Min_No_Ref))))","v":0},null,{"$f":"IF(OR(ADPT=ADPT01,ADPT=ADPT03),AIS_NA,\"Option 1\")","v":"Option 1"},null,1]
[null,null,null,null,null,null,null,null,null,null,null,null,null,null,null,null,null,null,null,null,null,null,null,"No",null,0.01,null,"KgCO2eq /10% project value",null,{"$f":"ADAS02","v":"Post Construction (Final, as-built)"},null,3,"Very Good","Very Good","Man02",0,0,0,1,2,{"$f":"IF(Score_option=_PSc2,IF(Man02_user=AS1385,AF1385,IF(Man02_user>AS1385,AF1384,AF1386)),IF(Man02_Tot=AS1385,AF1385,IF(Man02_Tot>AS1385,AF1384,AF1386)))","v":3},null,{"$f":"IF(OR(ADPT=ADPT01,ADPT=ADPT03),AIS_NA,\"Option 2\")","v":"Option 2"},null,2]
[null,null,null,null,null,null,null,null,null,null,null,null,null,null,null,null,null,null,null,null,null,null,null,"N/A",null,0.02,null,"KgCO2eq /km",null,null,null,2,"Good","Good","Man 04a",0,1,1,1,1,{"$f":"IF(ADBT0=ADBT8,5,IF(Score_option=_PSc1,IF(Man04_03=AIS_Yes,5,1),IF(Man04_user_mst=HUG,Min_Out_Ref,Min_Pas_Ref)))","v":1},null,{"$f":"IF(OR(ADPT=ADPT01,ADPT=ADPT03),AIS_NA,\"Option 3\")","v":"Option 3"},null,3]
[null,null,null,null,null,null,null,null,null,null,null,null,null,null,null,null,null,null,null,null,null,null,null,"Error",null,0.03,null,"KgCO2eq",null,null,null,1,"Pass","Pass","Man 04b",0,1,1,1,3,{"$f":"IF(ADBT0=ADBT8,AN1410,5)","v":5},null,{"$f":"IF(OR(ADPT=ADPT01,ADPT=ADPT03),AIS_NA,\"N/A\")","v":"N/A"},null,4]
[null,null,null,null,null,null,null,null,null,null,null,null,null,null,null,null,null,null,null,null,null,null,null,"Missing data",null,0.04,null,"m3/10% project value",null,null,null,0,"Unclassified","Unclassified","Hea01","Criteria1","Criteria1","Criteria1","Criteria1","Criteria1",{"$f":"IF(Score_option=_PSc2,IF(Hea01_user_mst=AIS_Yes,AF1384,AF1389),IF(Hea01_01=AIS_Yes,AF1384,AF1389))","v":0},null,null,null,5]
[null,null,null,null,null,null,null,null,null,null,null,null,null,null,null,null,null,null,null,null,null,null,null,"Measured",null,0.05,null,"m3",null,null,null,null,null,null,"Hea02","Criteria1","Criteria1","Criteria1","Criteria1","Criteria1",{"$f":"IF(Score_option=_PSc2,IF(Hea02_user_mst=AIS_Yes,5,0),IF(OR(Hea02_00=AIS_No,Hea02_00=\"\"),0,IF(Hea02_00=AIS_Yes,5)))","v":0},null,null,null,6]
[null,null,null,null,null,null,null,null,null,null,null,null,null,null,null,null,null,null,null,null,null,null,null,"Target",null,0.06,null,"Litres of fuel",null,null,null,null,null,null,"Hea04","Criteria1","Criteria1","Criteria1","Criteria1","Criteria1",{"$f":"IF(Score_option=_PSc2,IF(Hea04_user_mst=AIS_Yes,5,0),IF(Hea04_01=AIS_Yes,5,0))","v":0},null,{"$f":"IF(OR(ADPT=ADPT01,ADPT=ADPT03),AIS_NA,\"Option 1\")","v":"Option 1"},null,7]
[null,null,null,null,null,null,null,null,null,null,null,null,null,null,null,null,null,null,null,null,null,null,null,"Construction",null,7.0000000000000007E-2,null,"km",null,null,null,null,null,null,"Hea08",0,0,0,0,1,{"$f":"IF(Score_option=_PSc2,IF(ADBT0=ADBT8,IF(Hea08_user=0,Min_Ex_Ref,Min_Out_Ref),Min_Out_Ref),IF(ADBT0=ADBT8,IF(Hea08_tot=0,Min_Ex_Ref,Min_Out_Ref),Min_Out_Ref))","v":5},null,{"$f":"IF(OR(ADPT=ADPT01,ADPT=ADPT03),AIS_NA,\"Option 2: N/A\")","v":"Option 2: N/A"},null,8]
[null,null,null,null,null,null,null,null,null,null,null,null,null,null,null,null,null,null,null,null,null,null,null,"Use",null,0.08,null,"Litres/km",null,null,null,null,null,null,"Ene01",0,0,0,6,10,{"$f":"Ene01_75","v":3},null,{"$f":"IF(OR(ADPT=ADPT01,ADPT=ADPT03),AIS_NA,\"Option 3\")","v":"Option 3"},null,9]
[null,null,null,null,null,null,null,null,null,null,null,null,null,null,null,null,null,null,null,null,null,null,null,"Modelled",null,0.09,null,"µg/m3",null,null,null,null,null,null,"Ene02",0,0,1,1,1,{"$f":"IF(ADBT0=ADBT8,5,IF(Score_option=_PSc2,IF(Ene02_user_mst=AIS_Yes,5,2),IF(Ene02_02=AIS_Yes,5,2)))","v":2},null,{"$f":"IF(OR(ADPT=ADPT01,ADPT=ADPT03),AIS_NA,\"N/A\")","v":"N/A"},null,10]
[null,null,null,null,null,null,null,null,null,null,null,null,null,null,null,null,null,null,null,null,null,null,null,null,null,0.1,null,"%",null,null,null,null,null,null,"Ene04",0,0,0,1,1,{"$f":"IF(Score_option=_PSc2,IF(Ene04_user=0,Min_VG_Ref,IF(Ene04_user>0,Min_Out_Ref)),IF(Ene04_tot=0,Min_VG_Ref,IF(Ene04_tot>0,Min_Out_Ref)))","v":3},null,null,null,11]
[null,null,null,null,null,null,null,null,null,null,null,null,null,null,null,null,null,null,null,null,null,null,null,null,null,0.11,null,"L/person/day",null,null,null,null,null,null,"Wat01",0,0,1,1,2,{"$f":"IF(Score_option=_PSc2,IF(OR(Wat01_user=0,Wat01_user=AIS_Missing_data),Min_Gd_Ref,IF(OR(Wat01_user=2,Wat01_user=3,Wat01_user=4,Wat01_user=5),Min_Out_Ref,Min_Ex_Ref)),IF(OR(Wat01_tot=0,Wat01_tot=AIS_Missing_data),Min_Gd_Ref,IF(OR(Wat01_tot=2,Wat01_tot=3,Wat01_tot=4,Wat01_tot=5),Min_Out_Ref,Min_Ex_Ref)))","v":2},null,null,null,12]
[null,null,null,null,null,null,null,null,null,null,null,null,null,null,null,null,null,null,null,null,null,null,null,null,null,0.12,null,"m3/person/yr",null,null,null,null,null,null,"Wat02",0,"Criteria1","Criteria1","Criteria1","Criteria1",{"$f":"IF(Score_option=_PSc2,IF(Wat02_user_mst=AIS_Yes,Min_Out_Ref,Min_Pas_Ref),IF(Wat02_02=AIS_Yes,Min_Out_Ref,Min_Pas_Ref))","v":1},null,{"$f":"IF(OR(ADPT=ADPT01,ADPT=ADPT03),AIS_NA,\"Option 1: N/A\")","v":"Option 1: N/A"},null,13]
[null,null,null,null,null,null,null,null,null,null,null,null,null,null,null,null,null,null,null,null,null,null,null,null,null,0.13,null,"m3/100m2",null,null,null,null,null,null,"Mat03",0,0,0,0,"Criteria 1",{"$f":"IF(Score_option=_PSc2,IF(Mat03_user_mst=AIS_Yes,Min_Out_Ref,Min_Ex_Ref),IF(Mat03_Preopt=Mat03_Preopt2,IF(Mat03_prereq=AIS_Yes,Min_Out_Ref,Min_Ex_Ref),IF(Mat03_prereq=AIS_Yes,Min_Out_Ref,Min_Ex_Ref)))","v":4},null,{"$f":"IF(OR(ADPT=ADPT01,ADPT=ADPT03),AIS_NA,\"Option 3\")","v":"Option 3"},null,15]
[null,null,null,null,null,null,null,null,null,null,null,null,null,null,null,null,null,null,null,null,null,null,null,null,null,0.14000000000000001,null,"tonnes/100m2",null,null,null,null,null,null,"Wst01",0,0,0,0,1,{"$f":"IF(Score_option=_PSc2,IF(Wst01_user>0,Min_Out_Ref,Min_Ex_Ref),IF(Wst01_tot>0,Min_Out_Ref,Min_Ex_Ref))","v":4},null,{"$f":"IF(OR(ADPT=ADPT01,ADPT=ADPT03),AIS_NA,\"Option 4\")","v":"Option 4"},null,16]
[null,null,null,null,null,null,null,null,null,null,null,null,null,null,null,null,null,null,null,null,null,null,null,null,null,0.15,null,"volume",null,null,null,null,null,null,"Wst03",0,0,0,1,1,{"$f":"IF(Score_option=_PSc2,IF(Wst03_user>0,Min_Out_Ref,Min_VG_Ref),IF(Wst03_tot>0,Min_Out_Ref,Min_VG_Ref))","v":3},null,{"$f":"IF(OR(ADPT=ADPT01,ADPT=ADPT03),AIS_NA,\"N/A\")","v":"N/A"},null,17]
[null,null,null,null,null,null,null,null,null,null,null,null,null,null,null,null,null,null,null,null,null,null,null,null,null,0.16,null,"tonnes",null,null,null,null,null,null,null,null,null,null,null,"Minimum standard level",{"$f":"MIN(AIS_Minstand)","v":0},null,null,null,18]
[null,null,null,null,null,null,null,null,null,null,null,null,null,null,null,null,null,null,null,null,null,null,null,null,null,0.17,null,"%",null,null,null,null,null,null,null,null,null,null,null,"BREEAM rating level",{"$f":"VLOOKUP(BP_OverallScore,BP_rating_benchmarks,3,TRUE)","v":{"$error":"#N/A"}},null,{"$f":"IF(OR(ADPT=ADPT01,ADPT=ADPT03),AIS_NA,\"Option 1\")","v":"Option 1"},null,19]
[null,null,null,null,null,null,null,null,null,null,null,null,null,null,null,null,null,null,null,null,null,null,null,null,null,0.18,null,"m3",null,null,null,null,null,null,null,null,null,null,null,"Minimum standard level same or better than rating level",{"$f":"IF(OR(AIS_BREEAM_rating_level=AIS_MinStandMin,AIS_MinStandMin>AIS_BREEAM_rating_level),AIS_Yes,AIS_No)","v":{"$error":"#N/A"}},null,{"$f":"IF(OR(ADPT=ADPT01,ADPT=ADPT03),AIS_NA,\"Option 2: N/A\")","v":"Option 2: N/A"},null,20]
[null,null,null,null,null,null,null,null,null,null,null,null,null,null,null,null,null,null,null,null,null,null,null,null,null,0.19,null,"INA",null,null,null,null,null,null,0,"Unclassified",0,null,null,null,null,null,{"$f":"IF(OR(ADPT=ADPT01,ADPT=ADPT03),AIS_NA,\"Option 3\")","v":"Option 3"}]
[null,null,null,null,null,null,null,null,null,null,null,null,null,null,null,null,null,null,null,null,null,null,null,null,null,0.2,null,"Plant species richness",null,null,null,null,null,null,0.3,"Pass",1,null,null,null,null,null,{"$f":"IF(OR(ADPT=ADPT01,ADPT=ADPT03),AIS_NA,\"N/A\")","v":"N/A"}]
[null,null,null,null,null,null,null,null,null,null,null,null,null,null,null,null,null,null,null,null,null,null,null,null,null,0.21,null,"kgCO2eq/kW coolth capacity",null,null,null,null,null,null,0.45,"Good",2,null,"Residential minimum standards"]
[null,null,null,null,null,null,null,null,null,null,null,null,null,null,null,null,null,null,null,null,null,null,null,null,null,0.22,null,"kW",null,null,null,null,null,null,0.55000000000000004,"Very Good",3,null,"Three credits achieved",{"$f":"IF(Score_option=_PSc2,IF(Man04_user_mst=HUG_IAD,3,0),IF(AND(Man04_03b=AIS_Yes,Man04_02b=AIS_Yes),3,0))","v":0}]
[null,null,null,null,null,null,null,null,null,null,null,null,null,null,null,null,null,null,null,null,null,null,null,null,null,0.23,null,"m3/yr",null,null,null,null,null,null,0.7,"Excellent",4,null,"HUG credit achieved",{"$f":"IF(Score_option=_PSc2,IF(Man04_user_mst=HUG,1,0),IF(AND(Man04_03b=AIS_Yes,Man04_02b=AIS_No),1,0))","v":0}]
[null,null,null,null,null,null,null,null,null,null,null,null,null,null,null,null,null,null,null,null,null,null,null,null,null,0.24,null,"mg/kWh",null,null,null,null,null,null,0.85,"Outstanding",5,null,"Total min standards",{"$f":"SUM(AN1407:AN1408)","v":0}]
[null,null,null,null,null,null,null,null,null,null,null,null,null,null,null,null,null,null,null,null,null,null,null,null,null,0.25,null,"kWh/m2/yr",null,null,null,null,null,null,null,null,null,null,"Residential min standard",{"$f":"IF(AN1409=3,5,IF(AN1409=1,4,IF(AN1409=0,1,0)))","v":1}]
[null,null,null,null,null,null,null,null,null,null,null,null,null,null,null,null,null,null,null,null,null,null,null,null,null,0.26,null,"kWh/yr"]
[null,null,null,null,null,null,null,null,null,null,null,null,null,null,null,null,null,null,null,null,null,null,null,null,null,0.27,null,"%"]
[null,null,null,null,null,null,null,null,null,null,null,null,null,null,null,null,null,null,null,null,null,null,null,null,null,0.28000000000000003,null,"m3/100m2"]
[null,null,null,null,null,null,null,null,null,null,null,null,null,null,null,null,null,null,null,null,null,null,null,null,null,0.28999999999999998,null,"tonnes/100m2"]
[null,null,null,null,null,null,null,null,null,null,null,null,null,null,null,null,null,null,null,null,null,null,null,null,null,0.3]
[null,null,null,null,null,null,null,null,null,null,null,null,null,null,null,null,null,null,null,null,null,null,null,null,null,0.31]
[null,null,null,null,null,null,null,null,null,null,null,null,null,null,null,null,null,null,null,null,null,null,null,null,null,0.32]
[null,null,null,null,null,null,null,null,null,null,null,null,null,null,null,null,null,null,null,null,null,null,null,null,null,0.33]
[null,null,null,null,null,null,null,null,null,null,null,null,null,null,null,null,null,null,null,null,null,null,null,null,null,0.34]
[null,null,null,null,null,null,null,null,null,null,null,null,null,null,null,null,null,null,null,null,null,null,null,null,null,0.35]
[null,null,null,null,null,null,null,null,null,null,null,null,null,null,null,null,null,null,null,null,null,null,null,null,null,0.36]
[null,null,null,null,null,null,null,null,null,null,null,null,null,null,null,null,null,null,null,null,null,null,null,null,null,0.37]
[null,null,null,null,null,null,null,null,null,null,null,null,null,null,null,null,null,null,null,null,null,null,null,null,null,0.38]
[null,null,null,null,null,null,null,null,null,null,null,null,null,null,null,null,null,null,null,null,null,null,null,null,null,0.39]
[null,null,null,null,null,null,null,null,null,null,null,null,null,null,null,null,null,null,null,null,null,null,null,null,null,0.4]
[null,null,null,null,null,null,null,null,null,null,null,null,null,null,null,null,null,null,null,null,null,null,null,null,null,0.41]
[null,null,null,null,null,null,null,null,null,null,null,null,null,null,null,null,null,null,null,null,null,null,null,null,null,0.42]
[null,null,null,null,null,null,null,null,null,null,null,null,null,null,null,null,null,null,null,null,null,null,null,null,null,0.43]
[null,null,null,null,null,null,null,null,null,null,null,null,null,null,null,null,null,null,null,null,null,null,null,null,null,0.44]
[null,null,null,null,null,null,null,null,null,null,null,null,null,null,null,null,null,null,null,null,null,null,null,null,null,0.45]
[null,null,null,null,null,null,null,null,null,null,null,null,null,null,null,null,null,null,null,null,null,null,null,null,null,0.46]
[null,null,null,null,null,null,null,null,null,null,null,null,null,null,null,null,null,null,null,null,null,null,null,null,null,0.47]
[null,null,null,null,null,null,null,null,null,null,null,null,null,null,null,null,null,null,null,null,null,null,null,null,null,0.48]
[null,null,null,null,null,null,null,null,null,null,null,null,null,null,null,null,null,null,null,null,null,null,null,null,null,0.49]
[null,null,null,null,null,null,null,null,null,null,null,null,null,null,null,null,null,null,null,null,null,null,null,null,null,0.5]
[null,null,null,null,null,null,null,null,null,null,null,null,null,null,null,null,null,null,null,null,null,null,null,null,null,0.51]
[null,null,null,null,null,null,null,null,null,null,null,null,null,null,null,null,null,null,null,null,null,null,null,null,null,0.52]
[null,null,null,null,null,null,null,null,null,null,null,null,null,null,null,null,null,null,null,null,null,null,null,null,null,0.53]
[null,null,null,null,null,null,null,null,null,null,null,null,null,null,null,null,null,null,null,null,null,null,null,null,null,0.54]
[null,null,null,null,null,null,null,null,null,null,null,null,null,null,null,null,null,null,null,null,null,null,null,null,null,0.55000000000000004]
[null,null,null,null,null,null,null,null,null,null,null,null,null,null,null,null,null,null,null,null,null,null,null,null,null,0.56000000000000005]
[null,null,null,null,null,null,null,null,null,null,null,null,null,null,null,null,null,null,null,null,null,null,null,null,null,0.56999999999999995]
[null,null,null,null,null,null,null,null,null,null,null,null,null,null,null,null,null,null,null,null,null,null,null,null,null,0.57999999999999996]
[null,null,null,null,null,null,null,null,null,null,null,null,null,null,null,null,null,null,null,null,null,null,null,null,null,0.59]
[null,null,null,null,null,null,null,null,null,null,null,null,null,null,null,null,null,null,null,null,null,null,null,null,null,0.6]
[null,null,null,null,null,null,null,null,null,null,null,null,null,null,null,null,null,null,null,null,null,null,null,null,null,0.61]
[null,null,null,null,null,null,null,null,null,null,null,null,null,null,null,null,null,null,null,null,null,null,null,null,null,0.62]
[null,null,null,null,null,null,null,null,null,null,null,null,null,null,null,null,null,null,null,null,null,null,null,null,null,0.63]
[null,null,null,null,null,null,null,null,null,null,null,null,null,null,null,null,null,null,null,null,null,null,null,null,null,0.64]
[null,null,null,null,null,null,null,null,null,null,null,null,null,null,null,null,null,null,null,null,null,null,null,null,null,0.65]
[null,null,null,null,null,null,null,null,null,null,null,null,null,null,null,null,null,null,null,null,null,null,null,null,null,0.66]
[null,null,null,null,null,null,null,null,null,null,null,null,null,null,null,null,null,null,null,null,null,null,null,null,null,0.67]
[null,null,null,null,null,null,null,null,null,null,null,null,null,null,null,null,null,null,null,null,null,null,null,null,null,0.68]
[null,null,null,null,null,null,null,null,null,null,null,null,null,null,null,null,null,null,null,null,null,null,null,null,null,0.69]
[null,null,null,null,null,null,null,null,null,null,null,null,null,null,null,null,null,null,null,null,null,null,null,null,null,0.7]
[null,null,null,null,null,null,null,null,null,null,null,null,null,null,null,null,null,null,null,null,null,null,null,null,null,0.71]
[null,null,null,null,null,null,null,null,null,null,null,null,null,null,null,null,null,null,null,null,null,null,null,null,null,0.72]
[null,null,null,null,null,null,null,null,null,null,null,null,null,null,null,null,null,null,null,null,null,null,null,null,null,0.73]
[null,null,null,null,null,null,null,null,null,null,null,null,null,null,null,null,null,null,null,null,null,null,null,null,null,0.74]
[null,null,null,null,null,null,null,null,null,null,null,null,null,null,null,null,null,null,null,null,null,null,null,null,null,0.75]
[null,null,null,null,null,null,null,null,null,null,null,null,null,null,null,null,null,null,null,null,null,null,null,null,null,0.76]
[null,null,null,null,null,null,null,null,null,null,null,null,null,null,null,null,null,null,null,null,null,null,null,null,null,0.77]
[null,null,null,null,null,null,null,null,null,null,null,null,null,null,null,null,null,null,null,null,null,null,null,null,null,0.78]
[null,null,null,null,null,null,null,null,null,null,null,null,null,null,null,null,null,null,null,null,null,null,null,null,null,0.79]
[null,null,null,null,null,null,null,null,null,null,null,null,null,null,null,null,null,null,null,null,null,null,null,null,null,0.8]
[null,null,null,null,null,null,null,null,null,null,null,null,null,null,null,null,null,null,null,null,null,null,null,null,null,0.81]
[null,null,null,null,null,null,null,null,null,null,null,null,null,null,null,null,null,null,null,null,null,null,null,null,null,0.82]
[null,null,null,null,null,null,null,null,null,null,null,null,null,null,null,null,null,null,null,null,null,null,null,null,null,0.83]
[null,null,null,null,null,null,null,null,null,null,null,null,null,null,null,null,null,null,null,null,null,null,null,null,null,0.84]
[null,null,null,null,null,null,null,null,null,null,null,null,null,null,null,null,null,null,null,null,null,null,null,null,null,0.85]
[null,null,null,null,null,null,null,null,null,null,null,null,null,null,null,null,null,null,null,null,null,null,null,null,null,0.86]
[null,null,null,null,null,null,null,null,null,null,null,null,null,null,null,null,null,null,null,null,null,null,null,null,null,0.87]
[null,null,null,null,null,null,null,null,null,null,null,null,null,null,null,null,null,null,null,null,null,null,null,null,null,0.88]
[null,null,null,null,null,null,null,null,null,null,null,null,null,null,null,null,null,null,null,null,null,null,null,null,null,0.89]
[null,null,null,null,null,null,null,null,null,null,null,null,null,null,null,null,null,null,null,null,null,null,null,null,null,0.9]
[null,null,null,null,null,null,null,null,null,null,null,null,null,null,null,null,null,null,null,null,null,null,null,null,null,0.91]
[null,null,null,null,null,null,null,null,null,null,null,null,null,null,null,null,null,null,null,null,null,null,null,null,null,0.92]
[null,null,null,null,null,null,null,null,null,null,null,null,null,null,null,null,null,null,null,null,null,null,null,null,null,0.93]
[null,null,null,null,null,null,null,null,null,null,null,null,null,null,null,null,null,null,null,null,null,null,null,null,null,0.94]
[null,null,null,null,null,null,null,null,null,null,null,null,null,null,null,null,null,null,null,null,null,null,null,null,null,0.95]
[null,null,null,null,null,null,null,null,null,null,null,null,null,null,null,null,null,null,null,null,null,null,null,null,null,0.96]
[null,null,null,null,null,null,null,null,null,null,null,null,null,null,null,null,null,null,null,null,null,null,null,null,null,0.97]
[null,null,null,null,null,null,null,null,null,null,null,null,null,null,null,null,null,null,null,null,null,null,null,null,null,0.98]
[null,null,null,null,null,null,null,null,null,null,null,null,null,null,null,null,null,null,null,null,null,null,null,null,null,0.99]
[null,null,null,null,null,null,null,null,null,null,null,null,null,null,null,null,null,null,null,null,null,null,null,null,null,1]
[null,null,null,null,null,null,null,null,null,null,null,null,null,null,null,null,null,null,null,null,null,null,null,"Statements"]
[]
[null,null,null,null,null,null,null,null,null,null,null,null,null,null,null,null,null,null,null,null,null,null,null,"Note: For  assessments of healthcare buildings, construction site management criterion number 9 (EMS) must be achieved to award any credits for this assessment issue."]
[null,null,null,null,null,null,null,null,null,null,null,null,null,null,null,null,null,null,null,null,null,null,null,"Note: Compliance with the criteria and award of this credit is a minimum standard for achieving the BREEAM Good rating and above."]
[null,null,null,null,null,null,null,null,null,null,null,null,null,null,null,null,null,null,null,null,null,null,null,"Instruction: Please provide details of the BREEAM Accredited Professional in the project team  section of the Assessment Details page. "]
[null,null,null,null,null,null,null,null,null,null,null,null,null,null,null,null,null,null,null,null,null,null,null,"Note: Although the number of BREEAM credits achieved meets the minimum number required for the  Excellent rating level, the percentage improvement for the Actual building emission rate  has not met the minimum level required for Excellent."]
[null,null,null,null,null,null,null,null,null,null,null,null,null,null,null,null,null,null,null,null,null,null,null,"Note: Although the percentage improvement for the Actual building emission rate has met the minimum level required for the Excellent rating, the number of BREEAM credits achieved does not meet the minimum required for the Excellent level."]
[null,null,null,null,null,null,null,null,null,null,null,null,null,null,null,null,null,null,null,null,null,null,null,"Note: Although the number of BREEAM credits achieved meets the minimum number required for the Outstanding rating level, the percentage improvement for the Actual building emission rate has not met the minimum level required for Outstanding."]
[null,null,null,null,null,null,null,null,null,null,null,null,null,null,null,null,null,null,null,null,null,null,null,"Note: Although the percentage improvement for the Actual building emission rate has met the minimum level required for the Outstanding rating the number of BREEAM credits achieved does not meet the minimum required for the Outstanding rating level."]
[null,null,null,null,null,null,null,null,null,null,null,null,null,null,null,null,null,null,null,null,null,null,null,"Note: Although the EPRinc achieved exceeds the benchmark level required to award 15 credits, the building has not achieved the 100% improvement on the Notional emission rate, i.e.it is not a zero net CO2 emissions building, required to award all 15 BREEAM credits for Ene01."]
[null,null,null,null,null,null,null,null,null,null,null,null,null,null,null,null,null,null,null,null,null,null,null,"Note: Although the individual EPRinc performance levels for both non-domestic and domestic building areas achieves 15 credits, the building as a whole has not achieved the 100% improvement on the notional emission rate, i.e.it is not a zero net CO2 emissions building, required to award a total of 15 BREEAM credits for Ene01."]
[null,null,null,null,null,null,null,null,null,null,null,null,null,null,null,null,null,null,null,null,null,null,null,"Instruction: You have stated the building is not compliant, but awarded credits: please rectify."]
[null,null,null,null,null,null,null,null,null,null,null,null,null,null,null,null,null,null,null,null,null,null,null,"Note: This credit is not applicable to prison buildings."]
[null,null,null,null,null,null,null,null,null,null,null,null,null,null,null,null,null,null,null,null,null,null,null,"Note: This credit does not apply to industrial buildings with no office space."]
[null,null,null,null,null,null,null,null,null,null,null,null,null,null,null,null,null,null,null,null,null,null,null,"Note: You have stated in the Assessment Details tab that the assessed building has no office or laboratory space or fume cupboards, therefore this issue is not applicable to the assessment."]
[null,null,null,null,null,null,null,null,null,null,null,null,null,null,null,null,null,null,null,null,null,null,null,"Instruction: If the thermal modelling undertaken has not resulted in a TOR value, then insert \"INA\" (Indicator Not Assessed) in the relevant cell"]
[null,null,null,null,null,null,null,null,null,null,null,null,null,null,null,null,null,null,null,null,null,null,null,"Note: You have stated in the Assessment Details tab that the assessed building is an industrial building with no office space, therefore this issue does not require assessment."]
[null,null,null,null,null,null,null,null,null,null,null,null,null,null,null,null,null,null,null,null,null,null,null,"Note: Compliance with this item is a minimum standard for achieving any BREEAM rating level (it is not necessary to achieve the credit to comply with the minimum standards)."]
[null,null,null,null,null,null,null,null,null,null,null,null,null,null,null,null,null,null,null,null,null,null,null,"Note: where the assessed development does not have external site areas this issue does not apply. In such instances, the issue will be filtered out of the assessment scope."]
[null,null,null,null,null,null,null,null,null,null,null,null,null,null,null,null,null,null,null,null,null,null,null,"Note: where the assessed development has no risk from natural hazards (other than flooding) this issue does not apply. In such instances, the issue will be filtered out of the assessment scope."]
[null,null,null,null,null,null,null,null,null,null,null,null,null,null,null,null,null,null,null,null,null,null,null,"Note: the first credit within the BREEAM issue Hea 03 Thermal comfort has not been achieved, therefore the free cooling credit is not achievable."]
[null,null,null,null,null,null,null,null,null,null,null,null,null,null,null,null,null,null,null,null,null,null,null,"Instruction: If there will be no energy generation from LZC, please state zero in the relevant KPI cell."]
[null,null,null,null,null,null,null,null,null,null,null,null,null,null,null,null,null,null,null,null,null,null,null,"Instruction: Please confirm the energy source for the specified LZC system"]
[null,null,null,null,null,null,null,null,null,null,null,null,null,null,null,null,null,null,null,null,null,null,null,"Note: The sixth credit: 'Commissioning of building services' in issue Man01 must be achieved in order to award the first credit for Ene05."]
[null,null,null,null,null,null,null,null,null,null,null,null,null,null,null,null,null,null,null,null,null,null,null,"Note: The first Ene05 credit must be achieved before the third credit can be awarded."]
[null,null,null,null,null,null,null,null,null,null,null,null,null,null,null,null,null,null,null,null,null,null,null,"Note: You have stated in the Assessment Details tab that the assessed building does not have any commercial/industrial refrigeration and storage systems, therefore this issue is not applicable to the assessment."]
[null,null,null,null,null,null,null,null,null,null,null,null,null,null,null,null,null,null,null,null,null,null,null,"Note: You have stated in the Assessment Details tab that the assessed building does not have building user transportation systems (lifts and/or escalators), therefore this issue is not applicable to the assessment."]
[null,null,null,null,null,null,null,null,null,null,null,null,null,null,null,null,null,null,null,null,null,null,null,"Note: The first Ene06 credit must be achieved before this credit can be awarded."]
[null,null,null,null,null,null,null,null,null,null,null,null,null,null,null,null,null,null,null,null,null,null,null,"Note: You have stated in the Assessment Details tab that the assessed building does not have any laboratory areas and/or fume cupboards, therefore this issue is not applicable to the assessment."]
[null,null,null,null,null,null,null,null,null,null,null,null,null,null,null,null,null,null,null,null,null,null,null,"Note: Compliance with the laboratory fume cupboards and containment areas credit in issue Hea 02 Indoor Air Quality is required to award the first credit in this issue."]
[null,null,null,null,null,null,null,null,null,null,null,null,null,null,null,null,null,null,null,null,null,null,null,"Note: You have stated in the Assessment Details tab that the assessed building does not have any fume cupboards, therefore this credit is not applicable to the assessment."]
[null,null,null,null,null,null,null,null,null,null,null,null,null,null,null,null,null,null,null,null,null,null,null,"Note: This criteria is not applicable to the building type you have selected."]
[null,null,null,null,null,null,null,null,null,null,null,null,null,null,null,null,null,null,null,null,null,null,null,"Note: Where fume cupboards are present the BREEAM credit  concerning their specification must be achieved in order to achieve any of the available credits for best practice energy practices in laboratories."]
[null,null,null,null,null,null,null,null,null,null,null,null,null,null,null,null,null,null,null,null,null,null,null,"Instruction: If 'residential areas' is the only 'significant majority' contributor then please confirm whether the equipment is compliant with criteria E1,E2 & E3 OR criterion E4. If E4, only one credit is available. "]
[null,null,null,null,null,null,null,null,null,null,null,null,null,null,null,null,null,null,null,null,null,null,null,"Error: please change \"Yes\" to \"No\" if function area/equipment not present."]
[null,null,null,null,null,null,null,null,null,null,null,null,null,null,null,null,null,null,null,null,null,null,null,"Instruction: You have confirmed compliance but not stated which function areas/equipment are present and/or which make-up the significant majority, please confirm as appropriate or withhold the available credits."]
[null,null,null,null,null,null,null,null,null,null,null,null,null,null,null,null,null,null,null,null,null,null,null,"Note:  This issue is not applicable to the building type and/or sub-building type selected in the Assessment Details page."]
[null,null,null,null,null,null,null,null,null,null,null,null,null,null,null,null,null,null,null,null,null,null,null,"Note: A credit for a dedicated bus service is only available where the building has not achieved any credits using the public transport accessibility index (refer to the technical guide for further detail)."]
[null,null,null,null,null,null,null,null,null,null,null,null,null,null,null,null,null,null,null,null,null,null,null,"Instruction: the building type category must be defined for BREEAM issue Tra01 to calculate the total number of credits available for the transport section and therefore issue contribution to overall score."]
[null,null,null,null,null,null,null,null,null,null,null,null,null,null,null,null,null,null,null,null,null,null,null,"Note: This issue is not applicable to assessments of prison buildings."]
[null,null,null,null,null,null,null,null,null,null,null,null,null,null,null,null,null,null,null,null,null,null,null,"Instruction: If the building is non-compliant please award zero credits."]
[null,null,null,null,null,null,null,null,null,null,null,null,null,null,null,null,null,null,null,null,null,null,null,"Instruction: If the building is compliant then award the appropriate number of BREEAM credits in the relevant cell."]
[null,null,null,null,null,null,null,null,null,null,null,null,null,null,null,null,null,null,null,null,null,null,null,"Instruction: Please select the building type category (below) to define the number of credits available. "]
[null,null,null,null,null,null,null,null,null,null,null,null,null,null,null,null,null,null,null,null,null,null,null,"See note"]
[null,null,null,null,null,null,null,null,null,null,null,null,null,null,null,null,null,null,null,null,null,null,null,"Note: The credit available for cyclist facilities cannot be awarded if the building does not have the requisite number of cycle storage spaces"]
[null,null,null,null,null,null,null,null,null,null,null,null,null,null,null,null,null,null,null,null,null,null,null,"Instruction: If selecting shell only option 4 then you must change the relevant assessment criteria \"compliant\" option from \"yes\" to \"no\"."]
[null,null,null,null,null,null,null,null,null,null,null,null,null,null,null,null,null,null,null,null,null,null,null,"Note: This issue is not applicable for the building type category you have defined (in issue Tra03)"]
[null,null,null,null,null,null,null,null,null,null,null,null,null,null,null,null,null,null,null,null,null,null,null,"Instruction: The building type defined here is based on that selected above for issue Tra03. If you have not selected a type from Tra03 then you will need to do so before assessing this issue."]
[null,null,null,null,null,null,null,null,null,null,null,null,null,null,null,null,null,null,null,null,null,null,null,"Note: You have stated in the Assessment Details tab that the assessed building does not have either internal or external planting and/or soft landscaping or a vehicle wash system, therefore this issue is not applicable to the assessment."]
[null,null,null,null,null,null,null,null,null,null,null,null,null,null,null,null,null,null,null,null,null,null,null,"Note: Where a vehicle wash system is specified/installed, compliance with the 'minimising risk of contamination' criteria in assessment issue Hea 04 is required in order to award the available credit for compliant water efficient equipment."]
[null,null,null,null,null,null,null,null,null,null,null,null,null,null,null,null,null,null,null,null,null,null,null,"Instruction: Please delete the number of points from the cell if the element is not assessed/present or less than 80% of element is responsibly sourced."]
[null,null,null,null,null,null,null,null,null,null,null,null,null,null,null,null,null,null,null,null,null,null,null,"Note: An Insulation Index the same as or greater than two is required to achieve this credit."]
[null,null,null,null,null,null,null,null,null,null,null,null,null,null,null,null,null,null,null,null,null,null,null,"Note: at least 80% of the Insulating materials must be responsibly sourced to achieve this credit."]
[null,null,null,null,null,null,null,null,null,null,null,null,null,null,null,null,null,null,null,null,null,null,null,"Note: At the pre-assessment and design stage of assessment this will be a target benchmark or estimation, if/where reported in the SWMP. Where data not available enter \"INA\", i.e. Indicator Not Assessed, in the relevant cell."]
[null,null,null,null,null,null,null,null,null,null,null,null,null,null,null,null,null,null,null,null,null,null,null,"Note: At the pre-assessment and design stage of assessment this figure is estimated based on the target benchmark reported above."]
[null,null,null,null,null,null,null,null,null,null,null,null,null,null,null,null,null,null,null,null,null,null,null,"Instruction: For the post-construction stage review/assessment the data entered will be the actual construction waste volume/tonnes, as sourced from the SWMP summary datasheets or equivalent monitoring records/report  "]
[null,null,null,null,null,null,null,null,null,null,null,null,null,null,null,null,null,null,null,null,null,null,null,"Note: At the pre-assessment and design stage of assessment the percentages will most likely be based on targets, confirmed using  documentation that describes the intended source of the recycled/secondary aggregates and that the required amount (to achieve the quoted percentages) can be provided."]
[null,null,null,null,null,null,null,null,null,null,null,null,null,null,null,null,null,null,null,null,null,null,null,"Instruction: if the specification of the additional operational waste facility/facilities is not applicable due to the absence or lack of a consistent volume of the appropriate waste stream(s) then select \"N/A\"."]
[null,null,null,null,null,null,null,null,null,null,null,null,null,null,null,null,null,null,null,null,null,null,null,"Note: This assessment issue is applicable to office buildings only."]
[null,null,null,null,null,null,null,null,null,null,null,null,null,null,null,null,null,null,null,null,null,null,null,"Note: If none of the additional criteria apply, as confirmed by the Suitably Qualified Ecologist, the credits are awarded on the basis of compliance with the mandatory criteria."]
[null,null,null,null,null,null,null,null,null,null,null,null,null,null,null,null,null,null,null,null,null,null,null,"Instruction: For speculative buildings, if the building is designed to be fully naturally ventilated and therefore no 'refrigerant using' building services or systems will be specified for the fit out, then confirm \"no\" accordingly. Alternatively, or if not known, state \"yes\". Where stating yes, the assessment is then relying on one of the shell only options to commit the future tenant to either, not specify refrigerants or, specify refrigerants and refrigerant containing plant compliant to the level required for the credits sought."]
[null,null,null,null,null,null,null,null,null,null,null,null,null,null,null,null,null,null,null,null,null,null,null,"Note: You have stated in the Assessment Details tab that the assessed building is an industrial unit with no office areas and an untreated (not cooled or heated) operational area, as such this issue is not applicable."]
[null,null,null,null,null,null,null,null,null,null,null,null,null,null,null,null,null,null,null,null,null,null,null,"Instruction: If the NOx level for water heating is not known/reported then please insert the letters \"INA\" in the relevant cell. If, in accordance with the relevant compliance note in the technical guide, the water heating benchmark is not applicable to the assessed building, please insert the letters \"N/A\" in the cell, or alternatively enter the NOx emission level if it is known."]
[null,null,null,null,null,null,null,null,null,null,null,null,null,null,null,null,null,null,null,null,null,null,null,"Instruction: If the building meets the definition of a 'highly insulated building' and the NOx emission level is low enough to claim more than one BREEAM credit, then select the \"N/A\" option from the drop-down list against the option for defining the building as a 'highly insulated building'. The reporting tool will then award the credits on the basis of the NOx emission level entered. If you select \"yes\" from the drop-down list against the option for defining the building as a 'highly insulated building' then only a single credit can be awarded, in accordance with the compliance note 'Highly insulated building'."]
[null,null,null,null,null,null,null,null,null,null,null,null,null,null,null,null,null,null,null,null,null,null,null,"Instruction: If there are there no noise-sensitive areas/buildings within 800m radius of the development then no shell and core option is required i.e. select the 'N/A' option."]
[null,null,null,null,null,null,null,null,null,null,null,null,null,null,null,null,null,null,null,null,null,null,null,"Note: The Assessor must reference the BREEAM Innovation application reference numbers alongside other applicable evidential references in the 'Assessment References' worksheet when submitting the assessment for QA"]
[null,null,null,null,null,null,null,null,null,null,null,null,null,null,null,null,null,null,null,null,null,null,null,"Note: The  maximum number of BREEAM credits that can be awarded for innovation is capped at 10."]
[null,null,null,null,null,null,null,null,null,null,null,null,null,null,null,null,null,null,null,null,null,null,null,"Information not available at pre-assessment stage"]
[null,null,null,null,null,null,null,null,null,null,null,null,null,null,null,null,null,null,null,null,null,null,null,"Indicator Not Applicable"]
[null,null,null,null,null,null,null,null,null,null,null,null,null,null,null,null,null,null,null,null,null,null,null,"Indicator Not Assessed"]
[null,null,null,null,null,null,null,null,null,null,null,null,null,null,null,null,null,null,null,null,null,null,null,"Instruction: Invalid option selection, please re-try"]
[null,null,null,null,null,null,null,null,null,null,null,null,null,null,null,null,null,null,null,null,null,null,null,"Assessment Issue Not Applicable"]
[null,null,null,null,null,null,null,null,null,null,null,null,null,null,null,null,null,null,null,null,null,null,null,"Will a compliant Flood Risk Assessment be carried out?"]
[null,null,null,null,null,null,null,null,null,null,null,null,null,null,null,null,null,null,null,null,null,null,null,"Will a Flood Risk Assessment be undertaken and ground level of the building/access meet BREEAM criteria?"]
[null,null,null,null,null,null,null,null,null,null,null,null,null,null,null,null,null,null,null,null,null,null,null,"Instruction: You have awarded more credits than are available for this issue, please amend."]
[null,null,null,null,null,null,null,null,null,null,null,null,null,null,null,null,null,null,null,null,null,null,null,"Note: The data required for this assessment issue is sourced from the separate BREEAM Pol 01 calculator."]
[null,null,null,null,null,null,null,null,null,null,null,null,null,null,null,null,null,null,null,null,null,null,null,"Note: The energy consumption for heating or heating and cooling (where cooling specified) is sourced from the approved software's Building Regulations Output Document  (technical data sheet). This information is used to report the KPI for total NOx emissions, it is not required to award the available BREEAM credits (insert \"INA\" if not known)."]
[null,null,null,null,null,null,null,null,null,null,null,null,null,null,null,null,null,null,null,null,null,null,null,"Instruction: If the GWP of the specified refrigerants is 10 or less then two credits are awarded. For the purpose of reporting key building impacts the DELC calculation and cooling capacity of the system is still required (calculated using the separate Pol01 calculator), alternatively state \"INA\", i.e. Indicator Not Assessed, in the relevant cells."]
[null,null,null,null,null,null,null,null,null,null,null,null,null,null,null,null,null,null,null,null,null,null,null,"Instruction: If the total Direct Effect Life Cycle CO2eq. emissions from the system have not been calculated state \"INA\", i.e. Indicator Not Assessed, in the relevant cells."]
[null,null,null,null,null,null,null,null,null,null,null,null,null,null,null,null,null,null,null,null,null,null,null,"Note: Selecting shell  and core  option 2 for any of the criteria will result in only half the achieved credits being awarded regardless of the shell and core options selected for the other criteria."]
[null,null,null,null,null,null,null,null,null,null,null,null,null,null,null,null,null,null,null,null,null,null,null,"Note: Selecting shell  and core option 4 for any of the criteria will result in zero credits being awarded regardless of the shell and core options selected for the other criteria."]
[null,null,null,null,null,null,null,null,null,null,null,null,null,null,null,null,null,null,null,null,null,null,null,"See instruction"]
[null,null,null,null,null,null,null,null,null,null,null,null,null,null,null,null,null,null,null,null,null,null,null,"Note: You have stated that the cycle storage spaces are compliant but entered no figure or zero in the box above for the number of compliant cycle storage spaces provided, please clarify."]
[null,null,null,null,null,null,null,null,null,null,null,null,null,null,null,null,null,null,null,null,null,null,null,"Note: you have stated that cyclist facilities are compliant but not defined the cyclist facilities provided, please clarify."]
[null,null,null,null,null,null,null,null,null,null,null,null,null,null,null,null,null,null,null,null,null,null,null,"Instruction: Please insert the relevant number of credits achieved in the appropriate cell (as indicated)."]
[null,null,null,null,null,null,null,null,null,null,null,null,null,null,null,null,null,null,null,null,null,null,null,"Note: Data for the Ene01 Calculator for non-domestic buildings is sourced from the Building Regulations Output Document from the approved software (in the technical data sheet in the 'Energy and CO2 emissions summary' table). This data must be verified using BREEAM's Ene01 Compliance Checker website (hyperlink above) before entering in to the Ene01 Calculator opposite."]
[null,null,null,null,null,null,null,null,null,null,null,null,null,null,null,null,null,null,null,null,null,null,null,"Note: The relevant data for the domestic building areas is sourced from the SAP Datasheet from the approved software. This data must first be entered in to the 'Ene01 Supplementary Calculator for Multi-Residential Buildings Using SAP' to convert to the outputs required for the purposes of the BREEAM assessment. Once converted by the supplementary calculator the relevant data should be entered in to the boxes opposite."]
[null,null,null,null,null,null,null,null,null,null,null,null,null,null,null,null,null,null,null,null,null,null,null,"Note: Where both SBEM (Non-Domestic) and SAP (Domestic) outputs are used, the total credits achieved is determined by area weighting the credits achieved for the domestic and non-domestic performance of the building. The area weighted totals are then added together and round down to the nearest whole credit. The same method of area weighting is applied to the percentage improvement on the building's Target Emission Rate (except rounding is to two decimal places). The area weighted credits  and percentage improvement are the totals used to determine compliance with the Ene01 minimum standards."]
[null,null,null,null,null,null,null,null,null,null,null,null,null,null,null,null,null,null,null,null,null,null,null,"Instruction: If the building is designed to be 'carbon negative' then you should  enter 100% in the box opposite. If the percentage is less than 100% then the building is not defined as 'carbon negative'."]
[null,null,null,null,null,null,null,null,null,null,null,null,null,null,null,null,null,null,null,null,null,null,null,"SBEM only"]
[null,null,null,null,null,null,null,null,null,null,null,null,null,null,null,null,null,null,null,null,null,null,null,"SAP only"]
[null,null,null,null,null,null,null,null,null,null,null,null,null,null,null,null,null,null,null,null,null,null,null,"SBEM and SAP"]
[null,null,null,null,null,null,null,null,null,null,null,null,null,null,null,null,null,null,null,null,null,null,null,"Note: To achieve the second credit for appointing a BREEAM Accredited professional the first credit for a BREEAM AP appointment must first be achieved. The third credit for appointing a BREEAM AP can be awarded independently of the first two credits."]
[null,null,null,null,null,null,null,null,null,null,null,null,null,null,null,null,null,null,null,null,null,null,null,"To achieve the credit available for best practise commissioning codes of buiding services the building must comply with and achieve the first credit for commissioning of building services."]
[null,null,null,null,null,null,null,null,null,null,null,null,null,null,null,null,null,null,null,null,null,null,null,"Note: To achieve the second credit available for LCC the first credit must also be achieved."]
[null,null,null,null,null,null,null,null,null,null,null,null,null,null,null,null,null,null,null,null,null,null,null,"Note: To achieve the third credit available for LCC both the first and second credit must be achieved."]
[null,null,null,null,null,null,null,null,null,null,null,null,null,null,null,null,null,null,null,null,null,null,null,"Note: To award the second credit the first credit must also be achieved."]
[null,null,null,null,null,null,null,null,null,null,null,null,null,null,null,null,null,null,null,null,null,null,null,"Note: A compliant indoor air quality plan must be specified in order to achieve the available credit for VOC's compliance."]
[null,null,null,null,null,null,null,null,null,null,null,null,null,null,null,null,null,null,null,null,null,null,null,"Note: the change in ecological value is sourced from BREEAM's LE03/LE04 calculator"]
[null,null,null,null,null,null,null,null,null,null,null,null,null,null,null,null,null,null,null,null,null,null,null,"Instruction: If the building has not specified mechanical cooling then insert zero in the 'NOx emission level - cooling' box. If cooling is, or will be specified then enter the NOx emissions level for the system. If heating and cooling is provided by the same system then pro-rata the overall NOx emissions according to modelled heating/cooling demand in the building and enter the relevant values in each box."]
[null,null,null,null,null,null,null,null,null,null,null,null,null,null,null,null,null,null,null,null,null,null,null,"Note: Credits for this issue are determined on the basis of NOx emissions from space and water heating systems. However, where cooling is specified information on the performance of the cooling system is required for the purposes of reporting and benchmarking."]
[null,null,null,null,null,null,null,null,null,null,null,null,null,null,null,null,null,null,null,null,null,null,null,"Note: Please ensure you reference the unique ID number provided by the online BREEAM Ene01 Compliance Checker in the Assessment References section of your report."]
[null,null,null,null,null,null,null,null,null,null,null,null,null,null,null,null,null,null,null,null,null,null,null,"Note: BREEAM's online Ene01 Compliance Checker must be used to verify that the relevant information from the Technical Data Sheet in the BRUKL Output Document is accurate."]
[null,null,null,null,null,null,null,null,null,null,null,null,null,null,null,null,null,null,null,null,null,null,null,"Note: Buildings in Greater London - Transport for London hosts a Planning Information Database that allows users to search for a specific London location by street name, co-ordinates or postcode and then calculate the Accessibility Index (AI) for that location. \nThe Total AI is confirmed for the Point of Interest (POI) within the Summary Report, which can be downloaded and used as evidence of compliance for the assessed building. Go to: www.webptals.org.uk"]
[]
[null,null,null,null,null,null,null,null,null,null,null,null,null,null,null,null,null,null,null,null,null,null,null,"Man01 data"]
[]
[null,null,null,null,null,null,null,null,null,null,null,null,null,null,null,null,null,null,null,null,null,null,null,"Please select:"]
[null,null,null,null,null,null,null,null,null,null,null,null,null,null,null,null,null,null,null,null,null,null,null,"Considerate Constructors Scheme",null,"Please select",0]
[null,null,null,null,null,null,null,null,null,null,null,null,null,null,null,null,null,null,null,null,null,null,null,"Scheme not listed as compliant",null,"6 items achieved in each of the 4 sections of Checklist A1",1]
[null,null,null,null,null,null,null,null,null,null,null,null,null,null,null,null,null,null,null,null,null,null,null,"No scheme used on project",null,"All items achieved AND performance confirmed by independent assessment & verification",2]
[null,null,null,null,null,null,null,null,null,null,null,null,null,null,null,null,null,null,null,null,null,null,null,null,null,"BREEAM compliant considerate construction scheme used and performance independently confirmed",2]
[]
[]
[]
[null,null,null,null,null,null,null,null,null,null,null,null,null,null,null,null,null,null,null,null,null,null,null,"Hea03 data"]
[]
[null,null,null,null,null,null,null,null,null,null,null,null,null,null,null,null,null,null,null,null,null,null,null,{"$f":"IF(AND(Hea03_02=AIS_Yes,Hea03_01=AIS_Yes),Hea03_04,0)","v":0}]
[null,null,null,null,null,null,null,null,null,null,null,null,null,null,null,null,null,null,null,null,null,null,null,{"$f":"IF(AND(Hea03_02=AIS_Yes,Hea03_01=AIS_Yes,(OR(Hea03_08=AIS_option05,Hea03_08=AIS_option00))),Hea03_04,IF(AND(Hea03_02=AIS_Yes,Hea03_01=AIS_Yes,Hea03_08=AIS_option01),Hea03_04,IF(AND(Hea03_02=AIS_Yes,Hea03_01=AIS_Yes,Hea03_08=AIS_option02),Hea03_04*0.5,IF(AND(Hea03_02=AIS_Yes,Hea03_01=AIS_Yes,Hea03_08=AIS_option03),Hea03_04,IF(AND(Hea03_02=AIS_Yes,Hea03_01=AIS_Yes,Hea03_08=AIS_option04),0,0)))))","v":{"$error":"#REF!"}}]
[]
[null,null,null,null,null,null,null,null,null,null,null,null,null,null,null,null,null,null,null,null,null,null,null,"Hea04 data"]
[]
[null,null,null,null,null,null,null,null,null,null,null,null,null,null,null,null,null,null,null,null,null,null,null,{"$f":"IF(OR(ADPT=ADPT02,ADPT=ADPT04),IF(OR(Hea04_06=AIS_option02,Hea04_07=AIS_option02,Hea04_08=AIS_option02),AIS_option02,IF(AND(OR(Hea04_06=AIS_option01,Hea04_06=AIS_option03,Hea04_06=AIS_option05),OR(Hea04_07=AIS_option01,Hea04_07=AIS_option03,Hea04_07=AIS_option05),OR(Hea04_08=AIS_option01,Hea04_08=AIS_option03,Hea04_08=AIS_option05)),AIS_Yes)),AIS_Yes)","v":"Yes"}]
[]
[null,null,null,null,null,null,null,null,null,null,null,null,null,null,null,null,null,null,null,null,null,null,null,"Ene01 data"]
[null,null,null,null,null,null,null,null,null,null,null,null,null,null,null,null,null,null,null,null,null,null,null,"Ene01 Calculator version"]
[null,null,null,null,null,null,null,null,null,null,null,null,null,null,null,null,null,null,null,null,null,null,null,{"$f":"IF(AND(OR(ADBT0=ADBT8),AD_MultiRes_option01=AIS_Yes,AD_MultiRes_option02<1),AIS_statement91,IF(AND(OR(ADBT0=ADBT8),AD_MultiRes_option01=AIS_Yes,AD_MultiRes_option02=1),AIS_Statement101,AIS_statement90))","v":"SBEM only"},null,null,null,null,null,null,null,null,null,null,null,null,null,null,null,"Internal lighting missing"]
[null,null,null,null,null,null,null,null,null,null,null,null,null,null,null,null,null,null,null,null,null,null,null,null,null,null,null,null,null,null,null,null,null,null,null,null,null,null,null,"Non-residential",null,null,"Residential"]
[null,null,null,null,null,null,null,null,null,null,null,null,null,null,null,null,null,null,null,null,null,null,null,"STD DEV (Non-Domestic, SBEM)",null,null,"Non-Domestic, SBEM",null,"First stage (Non Domestic, SBEM)","EPR (Non Domestic, SBEM)",null,"Non-Domestic, SBEM only min St Level checker",null,"EPRNC","Credits",null,"Exemplary level scale",null,null,"EPRNC","Credits",null,"EPRNC","Credits"]
[null,null,null,null,null,null,null,null,null,null,null,null,null,null,null,null,null,null,null,null,null,null,null,{"$f":"IF(ENE01_Translate=Z1620,8.71,IF(ENE01_Translate=Z1621,5.53,IF(ENE01_Translate=Z1622,3.83,IF(ENE01_Translate=Z1623,3.18))))","v":8.7100000000000009},null,"Demand",{"$f":"IF(Ene01_02=0,1,(Ene01_03/Ene01_02))","v":1},"Demand",{"$f":"IF(Ene01_10>1,0,IF(Ene01_10<0,1,1-Ene01_10^Ene01_13))","v":0},{"$f":"IF(Ene01_16>1,0,Ene01_16*Ene01_19)","v":0},"Exc check",{"$f":"IF(Ene01_74<Ene01_31,AF1386)","v":3},null,0,0,null,0,0,null,0,0,null,0,0]
[null,null,null,null,null,null,null,null,null,null,null,null,null,null,null,null,null,null,null,null,null,null,null,{"$f":"IF(ENE01_Translate=Z1620,12.64,IF(ENE01_Translate=Z1621,8.1,IF(ENE01_Translate=Z1622,6.03,IF(ENE01_Translate=Z1623,4.79))))","v":12.64},null,"Consumption",{"$f":"IF(Ene01_04=0,1,(Ene01_05/Ene01_04))","v":1},"Consumption",{"$f":"IF(Ene01_11>1,0,IF(Ene01_11<0,1,1-Ene01_11^Ene01_14))","v":0},{"$f":"IF(Ene01_17>1,0,Ene01_17*Ene01_20)","v":0},"Exc check",{"$f":"IF(AND(Ene01_74>=Ene01_31,Ene01_24>=Ene01_29),AF1385)","v":false},null,0.06,1,null,0.1,1,null,6.9231000000000001E-2,1,null,7.4999999999999997E-2,1]
[null,null,null,null,null,null,null,null,null,null,null,null,null,null,null,null,null,null,null,null,null,null,null,{"$f":"IF(ENE01_Translate=Z1620,5.28,IF(ENE01_Translate=Z1621,3.7,IF(ENE01_Translate=Z1622,2.91,IF(ENE01_Translate=Z1623,2.32))))","v":5.28},null,"CO2",{"$f":"IF(Ene01_06=0,1,(Ene01_07/Ene01_06))","v":1},"CO2",{"$f":"IF(Ene01_12>1,0,IF(Ene01_12<0,1,1-Ene01_12^Ene01_15))","v":0},{"$f":"IF(Ene01_18>1,0,Ene01_18*Ene01_21)","v":0},"Exc check",{"$f":"IF(AND(Ene01_74>=Ene01_31,Ene01_24<Ene01_29),AF1386)","v":false},null,0.12,2,null,0.2,2,null,0.138462,2,null,0.15,2]
[null,null,null,null,null,null,null,null,null,null,null,null,null,null,null,null,null,null,null,null,null,null,null,null,null,null,null,null,"Overall EPRnc",{"$f":"ROUND(Ene01_22+Ene01_23+Ene01_24,4)","v":0},"Out checks",{"$f":"IF(AND(Ene01_74>=Ene01_32,Ene01_24>=Ene01_30),AF1384)","v":false},null,0.18,3,null,0.5,3,null,0.20769299999999999,3,null,0.22500000000000001,3]
[null,null,null,null,null,null,null,null,null,null,null,null,null,null,null,null,null,null,null,null,null,null,null,"Option 1: National Calculation Methodology or Dynamic Simulation Modelling",null,null,null,null,"BREEAM credits Internal Lighting, yes",{"$f":"VLOOKUP(Ene01_25,Ene01_credits_range,2,TRUE)","v":0},null,{"$f":"IF(AND(Ene01_22+Ene01_23+Ene01_24>=Ene01_86,Ene01_24=Ene01_84),AI1630,IF(AND(Ene01_22+Ene01_23+Ene01_24>=Ene01_86,Ene01_24<Ene01_84),AI1629))","v":false},"15 credits min levels check",0.24,4,null,0.8,4,null,0.276924,4,null,0.3,4]
[null,null,null,null,null,null,null,null,null,null,null,null,null,null,null,null,null,null,null,null,null,null,null,"Option 2: Energy efficient design features (Checklist A5)",null,"1. Best international practice in terms of energy efficient standards for buildings.",null,null,"BREEAM Residential credits Internal Lighting, no",{"$f":"VLOOKUP(Ene01_25,ENE01_Credits_Res_Range,2,TRUE)","v":0},null,{"$f":"IF(OR(Ene01_80=AIS_statement91,Ene01_80=AIS_Statement101),\"\",IF(OR(Ene01_25<0.9,Ene01_07>0),AIS_No,AIS_Yes))","v":"No"},"Innovation credits available",0.3,5,null,"Carbon negative",5,null,0.34615499999999999,5,null,0.375,5]
[null,null,null,null,null,null,null,null,null,null,null,null,null,null,null,null,null,null,null,null,null,null,null,null,null,"2. Good international practice in terms of energy efficient standards for buildings.",null,null,"BREEAM Non-Residential credits Internal Lighting, no",{"$f":"VLOOKUP(Ene01_25,ENE01_Credits_NonRes_Range,2,TRUE)","v":0},null,{"$f":"IF(Ene01_76=\"\",\"\",IF(Ene01_09<AH1630,0,IF(Ene01_37=AIS_Yes,AL1620,IF(Ene01_37=AIS_No,VLOOKUP(Ene01_36,AK1615:AL1619,2,TRUE),0))))","v":0},"Innovation credits achieved",0.36,6,null,null,null,null,0.41538599999999998,6,null,0.45,6]
[null,null,null,null,null,null,null,null,null,null,null,null,null,null,null,null,null,null,null,null,null,null,null,null,null,"3. Robust energy efficient standards for buildings.",null,null,null,null,null,null,null,0.42,7,null,null,null,null,0.48461700000000002,7,null,0.52500000000000002,7]
[null,null,null,null,null,null,null,null,null,null,null,null,null,null,null,null,null,null,null,null,null,null,null,null,null,"4. Some energy efficient targets and standards for buildings.",null,null,null,"EPR (SAP)",null,"SBEM and SAP min St Level checker",null,0.48,8,null,"Scale weights: Non-Domestic",null,null,0.55384800000000001,8,null,0.6,8]
[null,null,null,null,null,null,null,null,null,null,null,null,null,null,null,null,null,null,null,null,null,null,null,null,null,null,null,null,"Demand",{"$f":"'Ene01 Calibrators - Domestic'!Z66","v":0},"Exc check",{"$f":"IF(Ene01_73<Ene01_31,AF1386)","v":{"$error":"#VALUE!"}},null,0.54,9,"Demand",{"$f":"IF(Ene01_dem=AIS_No,0,IF(AND(Ene01_con=AIS_No,Ene01_co2=AIS_No),1,IF(Ene01_con=AIS_No,(Ene01_demW8/(Ene01_demW8+Ene01_co2W8)),IF(Ene01_co2=AIS_No,(Ene01_demW8/(Ene01_demW8+Ene01_conW8)),Ene01_demW8))))","v":0.23},0.23,null,0.62307900000000005,9,null,0.67500000000000004,9]
[null,null,null,null,null,null,null,null,null,null,null,null,null,null,null,null,null,null,null,null,null,null,null,null,null,null,null,null,"Consumption",{"$f":"'Ene01 Calibrators - Domestic'!AA66","v":0},"Exc check",{"$f":"IF(AND(Ene01_73>=Ene01_31,Ene01_81>=Ene01_71),AF1385)","v":{"$error":"#VALUE!"}},null,0.6,10,"Consumption",{"$f":"IF(Ene01_con=AIS_No,0,IF(AND(Ene01_dem=AIS_No,Ene01_co2=AIS_No),1,IF(Ene01_dem=AIS_No,(Ene01_conW8/(Ene01_conW8+Ene01_co2W8)),IF(Ene01_co2=AIS_No,(Ene01_conW8/(Ene01_demW8+Ene01_conW8)),Ene01_conW8))))","v":0.38},0.38,null,0.69230999999999998,10,null,0.75,10]
[null,null,null,null,null,null,null,null,null,null,null,null,null,null,null,null,null,null,null,null,null,null,null,null,null,null,null,null,"CO2",{"$f":"'Ene01 Calibrators - Domestic'!Y66","v":2.5167442061632433E-2},"Exc check",{"$f":"IF(AND(Ene01_73>=Ene01_31,Ene01_81<Ene01_71),AF1386)","v":{"$error":"#VALUE!"}},null,0.66,11,"CO2",{"$f":"IF(Ene01_co2=AIS_No,0,IF(AND(Ene01_con=AIS_No,Ene01_dem=AIS_No),1,IF(Ene01_con=AIS_No,(Ene01_co2W8/(Ene01_demW8+Ene01_co2W8)),IF(Ene01_dem=AIS_No,(Ene01_co2W8/(Ene01_co2W8+Ene01_conW8)),Ene01_co2W8))))","v":0.39},0.39,null,0.76154100000000002,11,null,0.82499999999999996,11]
[null,null,null,null,null,null,null,null,null,null,null,null,null,null,null,null,null,null,null,null,null,null,null,null,null,null,null,null,"Overall EPRnc",{"$f":"ROUND('Ene01 Calibrators - Domestic'!AB66,4)","v":2.52E-2},"Out checks",{"$f":"IF(AND(Ene01_73>Ene01_32,Ene01_81>=Ene01_72),AF1384)","v":{"$error":"#VALUE!"}},null,0.72,12,null,null,null,null,0.83077199999999995,12,null,0.9,12]
[null,null,null,null,null,null,null,null,null,null,null,null,null,null,null,null,null,null,null,null,null,null,null,"Min standards check",null,null,null,null,"BREEAM credits (domestic, SAP)",{"$f":"IF(ISERROR(IF(OR(ADPT=ADPT02,ADPT=ADPT04),IF(OR(Ene01_38=AIS_option02a,Ene01_38=AIS_option04a),0,VLOOKUP(Ene01_70,Ene01_credits_range,2,TRUE)),VLOOKUP(Ene01_70,Ene01_credits_range,2,TRUE))),0,IF(OR(ADPT=ADPT02,ADPT=ADPT04),IF(OR(Ene01_38=AIS_option02a,Ene01_38=AIS_option04a),0,VLOOKUP(Ene01_70,Ene01_credits_range,2,TRUE)),VLOOKUP(Ene01_70,Ene01_credits_range,2,TRUE)))","v":0},null,{"$f":"IF(AND(Ene01_73=Ene01_85,Ene01_81=Z1634),AI1630,IF(AND(Ene01_73=Ene01_85,Ene01_81<Z1634),AI1629))","v":{"$error":"#VALUE!"}},"15 credits min levels check",0.78,13,null,"Min Rating Standards level",null,null,0.900003,13]
[null,null,null,null,null,null,null,null,null,null,null,null,null,null,null,null,null,null,null,null,null,null,null,null,"EPR","% improvement","Credits",null,null,null,null,{"$f":"IF(OR(Ene01_80=AIS_statement90,Ene01_80=AIS_Statement101),\"\",IF(OR(Ene01_73<Ene01_85,AND(OR(Ene01_07>0,Ene01_49>0))),AIS_No,AIS_Yes))","v":""},"Innovation credits available",0.84,14,null,{"$f":"IF(Score_option=_PSc2,IF(OR(Ene01_user=6,Ene01_user=7,Ene01_user=8,Ene01_user=9),4,IF(Ene01_user>=10,5,3)),IF(OR(Ene01_tot=6,Ene01_tot=7,Ene01_tot=8,Ene01_tot=9),4,IF(Ene01_tot>=10,5,3)))","v":3}]
[null,null,null,null,null,null,null,null,null,null,null,null,null,null,null,null,null,null,null,null,null,null,null,"Min for Exc",{"$f":"(1-0.75^Ene01_15)*Ene01_21","v":0.30461372303736201},0.25,6,null,null,"Results: where SBEM and SAP used",null,{"$f":"IF(Ene01_77=\"\",\"\",IF(OR(Ene01_09<AH1630,Ene01_54<AH1630),0,IF(Ene01_37=AIS_Yes,AL1620,IF(Ene01_37=AIS_No,VLOOKUP(Ene01_36,AK1615:AL1619,2,TRUE),0))))","v":""},"Innovation credits achieved",0.9,15]
[null,null,null,null,null,null,null,null,null,null,null,null,null,null,null,null,null,null,null,null,null,null,null,"Min for Outs",{"$f":"(1-0.6^Ene01_15)*Ene01_21","v":0.36371528883460913},0.4,10,null,"SBEM area weighted credits",{"$f":"(1-AD_MultiRes_option02)*Ene01_74","v":{"$error":"#VALUE!"}}]
[null,null,null,null,null,null,null,null,null,null,null,null,null,null,null,null,null,null,null,null,null,null,null,null,"EPR","CO2 EPR","Credits",null,"SAP area weighted credits",{"$f":"AD_MultiRes_option02*Ene01_63","v":{"$error":"#VALUE!"}},null,"SAP only min St Level checker"]
[null,null,null,null,null,null,null,null,null,null,null,null,null,null,null,null,null,null,null,null,null,null,null,"Min for 15 credits",{"$f":"AH1630","v":0.9},{"$f":"Ene01_21","v":0.39},15,null,"Area weighted BREEAM credits (Non domestic and domestic, SBEM and SAP)",{"$f":"ROUNDDOWN(Ene01_60+Ene01_61,0)","v":{"$error":"#VALUE!"}},"Exc check",{"$f":"IF(Ene01_63<Ene01_31,AF1386)","v":3}]
[null,null,null,null,null,null,null,null,null,null,null,null,null,null,null,null,null,null,null,null,null,null,null,null,null,1,null,null,"Area weighted percentage improvement on TER",{"$f":"IF(ISERROR((AD_MultiRes_option02*Ene01_50)+((1-AD_MultiRes_option02)*Ene01_08)),0,(AD_MultiRes_option02*Ene01_50)+((1-AD_MultiRes_option02)*Ene01_08))","v":0},"Exc check",{"$f":"IF(AND(Ene01_63>=Ene01_31,Ene01_08>=Ene01_71),AF1385)","v":false}]
[null,null,null,null,null,null,null,null,null,null,null,null,null,null,null,null,null,null,null,null,null,null,null,null,null,null,null,null,null,null,"Exc check",{"$f":"IF(AND(Ene01_63>=Ene01_31,Ene01_08<Ene01_71),AF1386)","v":false}]
[null,null,null,null,null,null,null,null,null,null,null,null,null,null,null,null,null,null,null,null,null,null,null,null,null,null,null,null,null,null,"Out checks",{"$f":"IF(AND(Ene01_63>Ene01_32,Ene01_08>=Ene01_72),AF1384)","v":false}]
[null,null,null,null,null,null,null,null,null,null,null,null,null,null,null,null,null,null,null,null,null,null,null,"Please select:",null,null,null,null,null,null,null,{"$f":"IF(AND(Ene01_63=Ene01_85,Ene01_08=Z1634),AI1630,IF(AND(Ene01_63=Ene01_85,Ene01_08<Z1634),AI1629))","v":false},"15 credits min levels check"]
[null,null,null,null,null,null,null,null,null,null,null,null,null,null,null,null,null,null,null,null,null,null,null,"Enter building performance data into the Ene01 calculator",null,null,null,null,null,null,null,{"$f":"IF(OR(Ene01_80=AIS_statement90,Ene01_80=AIS_statement91),\"\",IF(OR(Ene01_70<0.9,Ene01_07>0),AIS_No,AIS_Yes))","v":""},"Innovation credits available"]
[null,null,null,null,null,null,null,null,null,null,null,null,null,null,null,null,null,null,null,null,null,null,null,"Define a target number of BREEAM credits achieved",null,null,null,null,null,null,null,{"$f":"IF(Ene01_91=\"\",\"\",IF(Ene01_09<AH1630,0,IF(Ene01_37=AIS_Yes,AL1620,IF(Ene01_37=AIS_No,VLOOKUP(Ene01_36,AK1615:AL1619,2,TRUE),0))))","v":""},"Innovation credits achieved"]
[]
[]
[null,null,null,null,null,null,null,null,null,null,null,null,null,null,null,null,null,null,null,null,null,null,null,"Ene04 data"]
[]
[null,null,null,null,null,null,null,null,null,null,null,null,null,null,null,null,null,null,null,null,null,null,null,"Please select",null,null,null,{"$f":"IF(Ene04_01=AIS_option13,\"Please select\",\"\")","v":{"$error":"#REF!"}},null,"Please select"]
[null,null,null,null,null,null,null,null,null,null,null,null,null,null,null,null,null,null,null,null,null,null,null,"Compliant LZC feasibility study",null,null,null,{"$f":"IF(Ene04_01=AIS_option13,\"Wind\",\"\")","v":{"$error":"#REF!"}},null,{"$f":"IF(Hea03_05=0,AIS_statement23,\"Building does not require any form of cooling i.e. naturally ventilated\")","v":"Free cooling - credit not achievable (see note)"}]
[null,null,null,null,null,null,null,null,null,null,null,null,null,null,null,null,null,null,null,null,null,null,null,"Compliant renewable energy supply contract",null,null,null,{"$f":"IF(Ene04_01=AIS_option13,\"Solar\",\"\")","v":{"$error":"#REF!"}},null,{"$f":"IF(Hea03_05=0,\"\",\"Building is cooled mechanically, not utilising ‘free’ cooling\")","v":""}]
[null,null,null,null,null,null,null,null,null,null,null,null,null,null,null,null,null,null,null,null,null,null,null,"No compliant feasibility study or renewable energy supply contract",null,null,null,{"$f":"IF(Ene04_01=AIS_option13,\"Aerothermal\",\"\")","v":{"$error":"#REF!"}},null,{"$f":"IF(Hea03_05=0,\"\",\"Absorption cooling, using waste heat\")","v":""}]
[null,null,null,null,null,null,null,null,null,null,null,null,null,null,null,null,null,null,null,null,null,null,null,null,null,null,null,{"$f":"IF(Ene04_01=AIS_option13,\"Geothermal\",\"\")","v":{"$error":"#REF!"}},null,{"$f":"IF(Hea03_05=0,\"\",\"Displacement ventilation\")","v":""}]
[null,null,null,null,null,null,null,null,null,null,null,null,null,null,null,null,null,null,null,null,null,null,null,"Free cooling - credit not achievable (see note)",null,null,null,{"$f":"IF(Ene04_01=AIS_option13,\"Hydrothermal\",\"\")","v":{"$error":"#REF!"}},null,{"$f":"IF(Hea03_05=0,\"\",\"Desiccant dehumidification and evaporative cooling, using waste heat\")","v":""}]
[null,null,null,null,null,null,null,null,null,null,null,null,null,null,null,null,null,null,null,null,null,null,null,null,null,null,null,{"$f":"IF(Ene04_01=AIS_option13,\"Hyrdopower\",\"\")","v":{"$error":"#REF!"}},null,{"$f":"IF(Hea03_05=0,\"\",\"Evaporative cooling, direct or indirect\")","v":""}]
[null,null,null,null,null,null,null,null,null,null,null,null,null,null,null,null,null,null,null,null,null,null,null,"Please select",null,null,null,{"$f":"IF(Ene04_01=AIS_option13,\"Biomass\",\"\")","v":{"$error":"#REF!"}},null,{"$f":"IF(Hea03_05=0,\"\",\"Ground coupled air cooling\")","v":""}]
[null,null,null,null,null,null,null,null,null,null,null,null,null,null,null,null,null,null,null,null,null,null,null,{"$f":"IF(Ene04_01=AIS_option13,\"Whole life cycle carbon savings/emissions\",\"\")","v":{"$error":"#REF!"}},null,null,null,{"$f":"IF(Ene04_01=AIS_option13,\"Biogas\",\"\")","v":{"$error":"#REF!"}},null,{"$f":"IF(Hea03_05=0,\"\",\"Ground water cooling\")","v":""}]
[null,null,null,null,null,null,null,null,null,null,null,null,null,null,null,null,null,null,null,null,null,null,null,{"$f":"IF(Ene04_01=AIS_option13,\"Operational stage carbon savings/emissions\",\"\")","v":{"$error":"#REF!"}},null,null,null,{"$f":"IF(Ene04_01=AIS_option13,\"Mains gas via compliant CHP plant\",\"\")","v":{"$error":"#REF!"}},null,{"$f":"IF(Hea03_05=0,\"\",\"Night-time cooling\")","v":""}]
[null,null,null,null,null,null,null,null,null,null,null,null,null,null,null,null,null,null,null,null,null,null,null,null,null,null,null,{"$f":"IF(Ene04_01=AIS_option13,\"Combination of one or more LZC energy sources\",\"\")","v":{"$error":"#REF!"}},null,{"$f":"IF(Hea03_05=0,\"\",\"Surface water cooling\")","v":""}]
[null,null,null,null,null,null,null,null,null,null,null,null,null,null,null,null,null,null,null,null,null,null,null,"Percentage net reduction in operational stage CO2 emissions",null,null,null,null,null,{"$f":"IF(Hea03_05=0,\"\",\"Other compliant free cooling strategy\")","v":""}]
[null,null,null,null,null,null,null,null,null,null,null,null,null,null,null,null,null,null,null,null,null,null,null,"Percentage net reduction in whole life cycle CO2 emissions"]
[null,null,null,null,null,null,null,null,null,null,null,null,null,null,null,null,null,null,null,null,null,null,null,"Additional credits not achievable for above option selection"]
[]
[]
[null,null,null,null,null,null,null,null,null,null,null,null,null,null,null,null,null,null,null,null,null,null,null,0,0]
[null,null,null,null,null,null,null,null,null,null,null,null,null,null,null,null,null,null,null,null,null,null,null,0.1,1]
[null,null,null,null,null,null,null,null,null,null,null,null,null,null,null,null,null,null,null,null,null,null,null,0.2,2]
[null,null,null,null,null,null,null,null,null,null,null,null,null,null,null,null,null,null,null,null,null,null,null,0.3,1]
[]
[]
[null,null,null,null,null,null,null,null,null,null,null,null,null,null,null,null,null,null,null,null,null,null,null,"Ene07 data"]
[]
[null,null,null,null,null,null,null,null,null,null,null,null,null,null,null,null,null,null,null,null,null,null,null,null,null,{"$f":"IF(Ene07_10=AD_Yes,1,0)","v":0}]
[null,null,null,null,null,null,null,null,null,null,null,null,null,null,null,null,null,null,null,null,null,null,null,null,null,{"$f":"IF(Ene07_11=AD_Yes,0.5,0)","v":0}]
[null,null,null,null,null,null,null,null,null,null,null,null,null,null,null,null,null,null,null,null,null,null,null,null,null,{"$f":"IF(Ene07_12=AD_Yes,0.5,0)","v":0}]
[null,null,null,null,null,null,null,null,null,null,null,null,null,null,null,null,null,null,null,null,null,null,null,null,null,{"$f":"IF(Ene07_13=AD_Yes,0.5,0)","v":0}]
[null,null,null,null,null,null,null,null,null,null,null,null,null,null,null,null,null,null,null,null,null,null,null,null,null,{"$f":"IF(Ene07_14=AD_Yes,0.5,0)","v":0}]
[null,null,null,null,null,null,null,null,null,null,null,null,null,null,null,null,null,null,null,null,null,null,null,null,null,{"$f":"IF(Ene07_15=AD_Yes,0.5,0)","v":0}]
[null,null,null,null,null,null,null,null,null,null,null,null,null,null,null,null,null,null,null,null,null,null,null,null,null,{"$f":"IF(Ene07_16=AD_Yes,0.5,0)","v":0}]
[null,null,null,null,null,null,null,null,null,null,null,null,null,null,null,null,null,null,null,null,null,null,null,null,null,{"$f":"IF(Ene07_17=AD_Yes,0.5,0)","v":0}]
[null,null,null,null,null,null,null,null,null,null,null,null,null,null,null,null,null,null,null,null,null,null,null,null,null,{"$f":"IF(Ene07_18=AD_Yes,0.5,0)","v":0}]
[null,null,null,null,null,null,null,null,null,null,null,null,null,null,null,null,null,null,null,null,null,null,null,null,null,{"$f":"IF(Ene07_19=AD_Yes,0.5,0)","v":0}]
[null,null,null,null,null,null,null,null,null,null,null,null,null,null,null,null,null,null,null,null,null,null,null,null,null,{"$f":"IF(Ene07_20=AD_Yes,0.5,0)","v":0}]
[null,null,null,null,null,null,null,null,null,null,null,null,null,null,null,null,null,null,null,null,null,null,null,null,null,{"$f":"IF(Ene07_01=AIS_statement32,AIS_NA,IF(Ene07_08=AIS_NA,AIS_NA,ROUNDDOWN(SUM(Z1668:Z1678),0)))","v":"N/A"}]
[null,null,null,null,null,null,null,null,null,null,null,null,null,null,null,null,null,null,null,null,null,null,null,null,"Fume cupboards present",{"$f":"IF(Ene07_04=1,IF(Ene07_03=AIS_No,0,IF(AND(Ene07_04=1,Ene07_03=AIS_Yes),IF(Ene07_21>Ene07_08,Ene07_08,Ene07_21))))","v":0}]
[null,null,null,null,null,null,null,null,null,null,null,null,null,null,null,null,null,null,null,null,null,null,null,null,"Fume cupboards not present",{"$f":"IF(Ene07_04=AIS_NA,IF(Ene07_21>Ene07_08,Ene07_08,Ene07_21))","v":false}]
[]
[null,null,null,null,null,null,null,null,null,null,null,null,null,null,null,null,null,null,null,null,null,null,null,"Ene08 data"]
[]
[null,null,null,null,null,null,null,null,null,null,null,null,null,null,null,null,null,null,null,null,null,null,null,"Req. E1-E3",null,{"$f":"IF(Ene08_25=AIS_statement36,AIS_Missing_data,IF(Ene08_23=AIS_statement35,AIS_Missing_data,IF(AND(Ene08_17=AIS_Yes,Ene08_24=AIS_statement34,Ene08_22=AIS_option24),1,IF(Ene08_17=AIS_Yes,Ene08_18,0))))","v":0}]
[null,null,null,null,null,null,null,null,null,null,null,null,null,null,null,null,null,null,null,null,null,null,null,"Req. E4"]
[]
[null,null,null,null,null,null,null,null,null,null,null,null,null,null,null,null,null,null,null,null,null,null,null,"Tra01 data"]
[null,null,null,null,null,null,null,null,null,null,null,null,null,null,null,null,null,null,null,null,null,null,null,null,null,null,null,null,null,"Building Types TRA01  International"]
[null,null,null,null,null,null,null,null,null,null,null,null,null,null,null,null,null,null,null,null,null,null,null,"Please select",null,null,"Type 1,2",0,null,"Please select:",null,null,"Type 1"]
[null,null,null,null,null,null,null,null,null,null,null,null,null,null,null,null,null,null,null,null,null,null,null,"Business (office/industrial) ","Type 1",null,0,0,null,"Type 1 - Staff & occasional business visitors e.g. Office & Industrial",3,null,"Type 2"]
[null,null,null,null,null,null,null,null,null,null,null,null,null,null,null,null,null,null,null,null,null,null,null,"Multi-Residential Accommodation","Type 1",null,{"$f":"IF(AD_tra01type=AD1696,0.5,2)","v":2},1,null,"Type 2 - Staff plus reasonably constant stream of visitors (Bespoke)",3,null,"Type 3"]
[null,null,null,null,null,null,null,null,null,null,null,null,null,null,null,null,null,null,null,null,null,null,null,"Pre-school, School and/or Sixth form","Type 1",null,{"$f":"IF(AD_tra01type=AD1696,1,4)","v":4},2,null,"Type 3 - Staff with large numbers of visitors e.g. Retail",5,null,"Type 4"]
[null,null,null,null,null,null,null,null,null,null,null,null,null,null,null,null,null,null,null,null,null,null,null,"Further Education/Vocational College","Type 2",null,{"$f":"IF(AD_tra01type=AD1696,2,8)","v":8},{"$f":"IF(OR(AD_tra01type=AD1694,AD_tra01type=AD1695),2,3)","v":3},null,"Type 4 - Rural building with few visitors (Bespoke)",2,null,"Type 5"]
[null,null,null,null,null,null,null,null,null,null,null,null,null,null,null,null,null,null,null,null,null,null,null,"Higher Education Type 1","Type 2",null,10,{"$f":"IF(OR(AD_tra01type=AD1694,AD_tra01type=AD1695),2,3)","v":3},null,"Type 5 - Rural building with large numbers of visitors (Bespoke)",2,null,"Type 7"]
[null,null,null,null,null,null,null,null,null,null,null,null,null,null,null,null,null,null,null,null,null,null,null,"Higher Education Type 2","Type 3",null,{"$f":"IF(AD_tra01type=AD1696,4,12)","v":12},{"$f":"IF(OR(AD_tra01type=AD1694,AD_tra01type=AD1695),2,IF(OR(AD_tra01type=AD1693,AD_tra01type=AD1696),4,3))","v":3},null,"Type 6 - Residential dwellings",4]
[null,null,null,null,null,null,null,null,null,null,null,null,null,null,null,null,null,null,null,null,null,null,null,"Retail","Type 2",null,18,{"$f":"IF(OR(AD_tra01type=AD1694,AD_tra01type=AD1695),2,IF(AD_tra01type=AD1696,4,IF(AD_tra01type=AD1693,5,IF(AD_tra01type=AD1697,4,3))))","v":3},null,"Type 7 - Transport Hub (Bespoke)",4]
[null,null,null,null,null,null,null,null,null,null,null,null,null,null,null,null,null,null,null,null,null,null,null,"Law Court","Type 2"]
[null,null,null,null,null,null,null,null,null,null,null,null,null,null,null,null,null,null,null,null,null,null,null,"Hospital (Excl. community hospital)","Type 2"]
[null,null,null,null,null,null,null,null,null,null,null,null,null,null,null,null,null,null,null,null,null,null,null,"GP Surgery, Health Centre, Community Hospital","Type 3"]
[null,null,null,null,null,null,null,null,null,null,null,null,null,null,null,null,null,null,null,null,null,null,null,"Other Building Type 1","Type 1"]
[null,null,null,null,null,null,null,null,null,null,null,null,null,null,null,null,null,null,null,null,null,null,null,"Other Building Type 2","Type 2"]
[null,null,null,null,null,null,null,null,null,null,null,null,null,null,null,null,null,null,null,null,null,null,null,"Other building Type 3","Type 4"]
[null,null,null,null,null,null,null,null,null,null,null,null,null,null,null,null,null,null,null,null,null,null,null,"Rural Location Sensitive Building","Type 4"]
[null,null,null,null,null,null,null,null,null,null,null,null,null,null,null,null,null,null,null,null,null,null,null,"Prison Site","Type 4"]
[null,null,null,null,null,null,null,null,null,null,null,null,null,null,null,null,null,null,null,null,null,null,null,"MOD Site","Type 4"]
[null,null,null,null,null,null,null,null,null,null,null,null,null,null,null,null,null,null,null,null,null,null,null,"Transport Hub","Type 5"]
[]
[null,null,null,null,null,null,null,null,null,null,null,null,null,null,null,null,null,null,null,null,null,null,null,"Tra02 data"]
[]
[null,null,null,null,null,null,null,null,null,null,null,null,null,null,null,null,null,null,null,null,null,null,null,0]
[null,null,null,null,null,null,null,null,null,null,null,null,null,null,null,null,null,null,null,null,null,null,null,{"$f":"IF(Tra02_01=AIS_No,\"\",1)","v":""}]
[null,null,null,null,null,null,null,null,null,null,null,null,null,null,null,null,null,null,null,null,null,null,null,{"$f":"IF(Tra02_01=AIS_No,\"\",IF(ADBT0=ADBT8,2,\"\"))","v":""}]
[]
[null,null,null,null,null,null,null,null,null,null,null,null,null,null,null,null,null,null,null,null,null,null,null,"Tra03 data"]
[]
[null,null,null,null,null,null,null,null,null,null,null,null,null,null,null,null,null,null,null,null,null,null,null,"Please select",null,"Please Select",null,{"$f":"IF(OR(Tra03_02=Tra03_option11,Tra03_02=Tra03_option16,Tra03_02=Tra03_option18),\"\",\"Please select\")","v":{"$error":"#VALUE!"}}]
[null,null,null,null,null,null,null,null,null,null,null,null,null,null,null,null,null,null,null,null,null,null,null,"Primary School",null,"1. Improved local cycling network",null,{"$f":"IF(OR(Tra03_02=Tra03_option11,Tra03_02=Tra03_option16,Tra03_02=Tra03_option18),\"\",\"Showers only\")","v":{"$error":"#VALUE!"}}]
[null,null,null,null,null,null,null,null,null,null,null,null,null,null,null,null,null,null,null,null,null,null,null,"Pre-school / crèche",null,"2. Improved local bus service",null,{"$f":"IF(OR(Tra03_02=Tra03_option11,Tra03_02=Tra03_option16,Tra03_02=Tra03_option18),\"\",\"Showers and changing facilities and lockers\")","v":{"$error":"#VALUE!"}}]
[null,null,null,null,null,null,null,null,null,null,null,null,null,null,null,null,null,null,null,null,null,null,null,"Secondary schools & sixth form",null,"3. Electric recharging stations",null,{"$f":"IF(OR(Tra03_02=Tra03_option11,Tra03_02=Tra03_option16,Tra03_02=Tra03_option18),\"\",\"Showers and drying space\")","v":{"$error":"#VALUE!"}}]
[null,null,null,null,null,null,null,null,null,null,null,null,null,null,null,null,null,null,null,null,null,null,null,"Further & Higher Education",null,"4. Car sharing",null,{"$f":"IF(OR(Tra03_02=Tra03_option11,Tra03_02=Tra03_option16,Tra03_02=Tra03_option18),\"\",\"Showers, changing facilities and drying space\")","v":{"$error":"#VALUE!"}}]
[null,null,null,null,null,null,null,null,null,null,null,null,null,null,null,null,null,null,null,null,null,null,null,"Business - offices, Industrial",null,"5. Cycle Storage",null,{"$f":"IF(OR(Tra03_02=Tra03_option11,Tra03_02=Tra03_option16,Tra03_02=Tra03_option18),\"\",\"Changing facility and lockers only\")","v":{"$error":"#VALUE!"}}]
[null,null,null,null,null,null,null,null,null,null,null,null,null,null,null,null,null,null,null,null,null,null,null,"Healthcare",null,{"$f":"IF(AD_tra01type=Tra01_type7,\"5.Cycle storage inc. public users\",\"5. Cycle Storage and facilities\")","v":"5. Cycle Storage and facilities"},null,{"$f":"IF(OR(Tra03_02=Tra03_option11,Tra03_02=Tra03_option16,Tra03_02=Tra03_option18),\"\",\"Changing facility and lockers and drying space\")","v":{"$error":"#VALUE!"}}]
[null,null,null,null,null,null,null,null,null,null,null,null,null,null,null,null,null,null,null,null,null,null,null,"Retail – Shopping centre / retail park",null,null,null,{"$f":"IF(OR(Tra03_02=Tra03_option11,Tra03_02=Tra03_option16,Tra03_02=Tra03_option18),\"\",\"Drying space only\")","v":{"$error":"#VALUE!"}}]
[null,null,null,null,null,null,null,null,null,null,null,null,null,null,null,null,null,null,null,null,null,null,null,"Retail – Individual retail unit",null,"Please Select",null,{"$f":"IF(OR(Tra03_02=Tra03_option11,Tra03_02=Tra03_option16,Tra03_02=Tra03_option18),\"\",\"No compliant facilities\")","v":{"$error":"#VALUE!"}}]
[null,null,null,null,null,null,null,null,null,null,null,null,null,null,null,null,null,null,null,null,null,null,null,"Law Court",null,"1. Improved local cycling network"]
[null,null,null,null,null,null,null,null,null,null,null,null,null,null,null,null,null,null,null,null,null,null,null,"Prison establishment located building",null,"2. Improved local bus service"]
[null,null,null,null,null,null,null,null,null,null,null,null,null,null,null,null,null,null,null,null,null,null,null,"Student residences and key worker accommodation",null,"3. Electric recharging stations 1 credit"]
[null,null,null,null,null,null,null,null,null,null,null,null,null,null,null,null,null,null,null,null,null,null,null,"Sheltered housing, care home, supported housing/living facility",null,"3. Electric recharging stations 2 credits"]
[null,null,null,null,null,null,null,null,null,null,null,null,null,null,null,null,null,null,null,null,null,null,null,"Other Building - transport type 1",null,"4. Car sharing"]
[null,null,null,null,null,null,null,null,null,null,null,null,null,null,null,null,null,null,null,null,null,null,null,"Other Building - transport type 2",null,"5. Cycle Storage 1 credit"]
[null,null,null,null,null,null,null,null,null,null,null,null,null,null,null,null,null,null,null,null,null,null,null,"Other Building - transport type 3",null,"5. Cycle Storage 2 credits"]
[null,null,null,null,null,null,null,null,null,null,null,null,null,null,null,null,null,null,null,null,null,null,null,"Other Building - Transport hub"]
[null,null,null,null,null,null,null,null,null,null,null,null,null,null,null,null,null,null,null,null,null,null,null,"Other Building - M.O.D non-residential"]
[null,null,null,null,null,null,null,null,null,null,null,null,null,null,null,null,null,null,null,null,null,null,null,"Other Building - M.O.D residential"]
[]
[null,null,null,null,null,null,null,null,null,null,null,null,null,null,null,null,null,null,null,null,null,null,null,"Tra04 data"]
[]
[null,null,null,null,null,null,null,null,null,null,null,null,null,null,null,null,null,null,null,null,null,null,null,"Please select"]
[null,null,null,null,null,null,null,null,null,null,null,null,null,null,null,null,null,null,null,null,null,null,null,{"$f":"IF(Tra04_AI<=4,\"1 space per 3 building users\",IF(Tra04_AI>=8,\"1 space per 5 building users\",\"1 space per 4 building users\"))","v":"1 space per 3 building users"}]
[null,null,null,null,null,null,null,null,null,null,null,null,null,null,null,null,null,null,null,null,null,null,null,{"$f":"IF(Tra04_AI<=4,\"1 space per 4 building users\",IF(Tra04_AI>=8,\"1 space per 6 building users\",\"1 space per 5 building users\"))","v":"1 space per 4 building users"}]
[]
[]
[]
[null,null,null,null,null,null,null,null,null,null,null,null,null,null,null,null,null,null,null,null,null,null,null,"Wat01 data"]
[]
[null,null,null,null,null,null,null,null,null,null,null,null,null,null,null,null,null,null,null,null,null,null,null,"Standard approach",null,"Preciptation Zone",null,"Select percentage improvement:",null,"Baseline",0]
[null,null,null,null,null,null,null,null,null,null,null,null,null,null,null,null,null,null,null,null,null,null,null,"Alternative approach",null,"Zone 1",null,"Less than 12.5% - zero credits",null,"Level 1 - one credit",1]
[null,null,null,null,null,null,null,null,null,null,null,null,null,null,null,null,null,null,null,null,null,null,null,null,null,"Zone 2",null,"12.5% - one credit",null,"Level 2 - two credits",2]
[null,null,null,null,null,null,null,null,null,null,null,null,null,null,null,null,null,null,null,null,null,null,null,"Building compliant with Wat01 criteria 7? ",null,"Zone 3",null,"25% - two credits",null,"Level 3 - three credits",3,0,0]
[null,null,null,null,null,null,null,null,null,null,null,null,null,null,null,null,null,null,null,null,null,null,null,null,null,null,null,{"$f":"IF(AD_p_zone=AD_p_zone1,\"40% - three credits\",\"35% - three credits\")","v":"35% - three credits"},null,"Level 4 - four credits",4,0.5,1]
[null,null,null,null,null,null,null,null,null,null,null,null,null,null,null,null,null,null,null,null,null,null,null,"Standard approach data",null,null,null,{"$f":"IF(AD_p_zone=AD_p_zone1,\"50% - four credits\",IF(AD_p_zone=AD_P_zone2,\"45% - four credits\",IF(AD_p_zone=AD_P_Zone3,\"40% - four credits\",\"50% - four credits\")))","v":"50% - four credits"},null,"Level 5 - five credits",5,0.75,2]
[null,null,null,null,null,null,null,null,null,null,null,null,null,null,null,null,null,null,null,null,null,null,null,"Alternative approach data",null,null,null,{"$f":"IF(AD_p_zone=AD_P_Zone3,\"50% - five credits\",\"55% - five credits\")","v":"55% - five credits"},null,"Level 5 + Exemplary level",5,0.95,1]
[null,null,null,null,null,null,null,null,null,null,null,null,null,null,null,null,null,null,null,null,null,null,null,null,null,null,null,{"$f":"IF(AD_p_zone=AD_P_Zone3,\"60% - 5 credits + Exemplary level\",\"65% - 5 credits + Exemplary level\")","v":"65% - 5 credits + Exemplary level"},null,"Alternative approach sub-total",{"$f":"IF(Wat01_01=AIS_option10,(VLOOKUP(Wat01_10,Wat01_Alt_bench,2,FALSE)+(VLOOKUP(Wat01_11,Wat01_Alt_bench01,2,TRUE))))","v":{"$error":"#N/A"}}]
[null,null,null,null,null,null,null,null,null,null,null,null,null,null,null,null,null,null,null,null,null,null,null,null,null,null,null,null,null,"Alternative approach total",{"$f":"IF(Wat01_Alt_subtotal=6,5,Wat01_Alt_subtotal)","v":{"$error":"#N/A"}}]
[null,null,null,null,null,null,null,null,null,null,null,null,null,null,null,null,null,null,null,null,null,null,null,0,0]
[null,null,null,null,null,null,null,null,null,null,null,null,null,null,null,null,null,null,null,null,null,null,null,0.125,1,null,null,{"$f":"IF(AND(OR(ADPT=ADPT02,ADPT=ADPT04),OR(Wat01_12=AIS_option02a,Wat01_12=AIS_option04a)),0,(IF(OR(Wat01_10=Wat01_exemplary,Wat01_10=Wat01_5cr),5,IF(Wat01_10=Wat01_4cr,4,IF(Wat01_10=Wat01_3cr,3,IF(Wat01_10=Wat01_2cr,2,IF(Wat01_10=Wat01_1cr,1,0)))))))","v":{"$error":"#REF!"}},null,null,0,0,null,0,0]
[null,null,null,null,null,null,null,null,null,null,null,null,null,null,null,null,null,null,null,null,null,null,null,0.25,2,null,null,null,null,null,0.125,1,null,0.125,1]
[null,null,null,null,null,null,null,null,null,null,null,null,null,null,null,null,null,null,null,null,null,null,null,{"$f":"IF(Wat01_Zone=Z1748,0.4,IF(Wat01_Zone=Z1749,0.35,IF(Wat01_Zone=Z1750,0.35,0.35)))","v":0.4},3,null,null,"Please select:",null,null,0.25,2,null,0.25,2]
[null,null,null,null,null,null,null,null,null,null,null,null,null,null,null,null,null,null,null,null,null,null,null,{"$f":"IF(Wat01_Zone=Z1748,0.5,IF(Wat01_Zone=Z1749,0.45,IF(Wat01_Zone=Z1750,0.4,0.45)))","v":0.5},4,null,null,"Actual/equivalent % of flushing demand met using recycled non potable water",null,null,0.4,3,null,0.4,3]
[null,null,null,null,null,null,null,null,null,null,null,null,null,null,null,null,null,null,null,null,null,null,null,{"$f":"IF(Wat01_Zone=Z1748,0.55,IF(Wat01_Zone=Z1749,0.55,IF(Wat01_Zone=Z1750,0.5,0.55)))","v":0.55000000000000004},5,null,null,"% of rainwater run-off collected & used to meet permissible demand",null,null,0.5,4,null,0.5,4]
[null,null,null,null,null,null,null,null,null,null,null,null,null,null,null,null,null,null,null,null,null,null,null,null,null,null,null,"% of waste water collected and recycled to meet permissible demand",null,null,0.55000000000000004,5,null,0.55000000000000004,5]
[null,null,null,null,null,null,null,null,null,null,null,null,null,null,null,null,null,null,null,null,null,null,null,0,0]
[null,null,null,null,null,null,null,null,null,null,null,null,null,null,null,null,null,null,null,null,null,null,null,{"$f":"IF(Wat01_Zone=Z1748,0.65,IF(Wat01_Zone=Z1749,0.65,IF(Wat01_Zone=Z1750,0.6,0.65)))","v":0.65},1,null,null,null,null,null,0,0,null,0,0]
[null,null,null,null,null,null,null,null,null,null,null,null,null,null,null,null,null,null,null,null,null,null,null,null,null,null,null,null,null,null,0.65,1,null,0.65,1]
[null,null,null,null,null,null,null,null,null,null,null,null,null,null,null,null,null,null,null,null,null,null,null,"Mat01 data"]
[]
[null,null,null,null,null,null,null,null,null,null,null,null,null,null,null,null,null,null,null,null,null,null,null,{"$f":"IF(OR(Mat01_09=\"\",Mat01_15=\"\",Mat01_21=\"\"),AIS_No,AIS_Yes)","v":"No"},null,"Type","Credits"]
[null,null,null,null,null,null,null,null,null,null,null,null,null,null,null,null,null,null,null,null,null,null,null,{"$f":"IF(OR(Mat01_10=\"\",Mat01_16=\"\",Mat01_22=\"\"),AIS_No,AIS_Yes)","v":"No"},null,"Office",5]
[null,null,null,null,null,null,null,null,null,null,null,null,null,null,null,null,null,null,null,null,null,null,null,{"$f":"IF(OR(Mat01_11=\"\",Mat01_17=\"\",Mat01_23=\"\"),AIS_No,AIS_Yes)","v":"No"},null,"Retail",5]
[null,null,null,null,null,null,null,null,null,null,null,null,null,null,null,null,null,null,null,null,null,null,null,{"$f":"IF(OR(Mat01_12=\"\",Mat01_18=\"\",Mat01_24=\"\"),AIS_No,AIS_Yes)","v":"No"},null,"Industrial",2]
[null,null,null,null,null,null,null,null,null,null,null,null,null,null,null,null,null,null,null,null,null,null,null,{"$f":"IF(OR(Mat01_13=\"\",Mat01_19=\"\",Mat01_25=\"\"),AIS_No,AIS_Yes)","v":"No"},null,"Education",6]
[null,null,null,null,null,null,null,null,null,null,null,null,null,null,null,null,null,null,null,null,null,null,null,{"$f":"IF(OR(Mat01_14=\"\",Mat01_20=\"\",Mat01_26=\"\"),AIS_No,AIS_Yes)","v":"No"},null,"Healthcare",6]
[null,null,null,null,null,null,null,null,null,null,null,null,null,null,null,null,null,null,null,null,null,null,null,{"$f":"IF(OR(X1768=AIS_No,X1769=AIS_No,X1770=AIS_No,X1771=AIS_No,X1772=AIS_No,X1773=AIS_No),AIS_No,AIS_Yes)","v":"No"},null,"Prisons",4]
[null,null,null,null,null,null,null,null,null,null,null,null,null,null,null,null,null,null,null,null,null,null,null,null,null,"Courts",6]
[null,null,null,null,null,null,null,null,null,null,null,null,null,null,null,null,null,null,null,null,null,null,null,null,null,"Multi-residential",6]
[null,null,null,null,null,null,null,null,null,null,null,null,null,null,null,null,null,null,null,null,null,null,null,null,null,"Other buildings",6]
[]
[null,null,null,null,null,null,null,null,null,null,null,null,null,null,null,null,null,null,null,null,null,null,null,"Mat03 data"]
[]
[null,null,null,null,null,null,null,null,null,null,null,null,null,null,null,null,null,null,null,null,null,null,null,"Standard level",null,"Please select:"]
[null,null,null,null,null,null,null,null,null,null,null,null,null,null,null,null,null,null,null,null,null,null,null,0,0,"Define the building elements that will be responsibly sourced"]
[null,null,null,null,null,null,null,null,null,null,null,null,null,null,null,null,null,null,null,null,null,null,null,0.18,1,"Define a target number of BREEAM credits"]
[null,null,null,null,null,null,null,null,null,null,null,null,null,null,null,null,null,null,null,null,null,null,null,0.36,2]
[null,null,null,null,null,null,null,null,null,null,null,null,null,null,null,null,null,null,null,null,null,null,null,0.54,3]
[]
[null,null,null,null,null,null,null,null,null,null,null,null,null,null,null,null,null,null,null,null,null,null,null,"Exemplary level",0.7]
[]
[null,null,null,null,null,null,null,null,null,null,null,null,null,null,null,null,null,null,null,null,null,null,null,{"$f":"COUNTIF(Mat03_data_range01,AIS_statement62)","v":0}]
[]
[null,null,null,null,null,null,null,null,null,null,null,null,null,null,null,null,null,null,null,null,null,null,null,"Wst01 data"]
[]
[null,null,null,null,null,null,null,null,null,null,null,null,null,null,null,null,null,null,null,null,null,null,null,"Construction waste benchmarks",null,null,null,null,null,"Waste diversion benchmarks",null,null,null,null,null,"Waste diversion benchmarks"]
[null,null,null,null,null,null,null,null,null,null,null,null,null,null,null,null,null,null,null,null,null,null,null,"Standard BREEAM credit benchmarks ","Volume","Tonnes",null,"Please select:",null,"Standard BREEAM credit benchmarks ","Volume","Tonnes",null,null,null,"Exemplary level","Volume","Tonnes"]
[null,null,null,null,null,null,null,null,null,null,null,null,null,null,null,null,null,null,null,null,null,null,null,null,13.4,11.2,0,"Define the proposed level of construction waste management",null,"Non demolition",0.7,0.8,1,null,null,"Non demolition",0.85,0.9]
[null,null,null,null,null,null,null,null,null,null,null,null,null,null,null,null,null,null,null,null,null,null,null,null,13.3,11.1,1,"Define a target number of BREEAM credits",null,"Demolition",0.8,0.9,null,null,null,"Demolition",0.85,0.95]
[null,null,null,null,null,null,null,null,null,null,null,null,null,null,null,null,null,null,null,null,null,null,null,null,7.5,6.5,2]
[null,null,null,null,null,null,null,null,null,null,null,null,null,null,null,null,null,null,null,null,null,null,null,null,3.4,3.2,3,null,null,"Standard BREEAM credit calculation","Volume","Tonnes",null,null,null,"Exemplary level BREEAM credit calculation","Volume","Tonnes"]
[null,null,null,null,null,null,null,null,null,null,null,null,null,null,null,null,null,null,null,null,null,null,null,"Standard Result",{"$f":"IF(Wst01_02=\"\",\"\",IF(Wst01_02>Y1796,0,IF(AND(Wst01_02<=Y1796,Wst01_02>Y1797),AA1796,IF(AND(Wst01_02<=Y1797,Wst01_02>Y1798),AA1797,IF(Wst01_02<=Y1798,AA1798)))))","v":0},{"$f":"IF(Wst01_02=\"\",\"\",IF(Wst01_02>Z1796,0,IF(AND(Wst01_02<=Z1796,Wst01_02>Z1797),AA1796,IF(AND(Wst01_02<=Z1797,Wst01_02>Z1798),AA1797,IF(Wst01_02<=Z1798,AA1798)))))","v":0},null,null,null,"Non demolition",{"$f":"IF(Wst01_04=AIS_units18,IF(Wst01_01=AIS_No,AIS_No,IF(Wst01_05>=AE1795,AIS_Yes,AIS_No)),AIS_NA)","v":"N/A"},{"$f":"IF(Wst01_04=AIS_units21,IF(Wst01_01=AIS_No,AIS_No,IF(Wst01_05>=AF1795,AIS_Yes,AIS_No)),AIS_NA)","v":"N/A"},null,null,null,"Non demolition",{"$f":"IF(Wst01_04=AIS_units18,IF(Wst01_01=AIS_No,AIS_No,IF(Wst01_05>=AK1795,AIS_Yes,AIS_No)),AIS_NA)","v":"N/A"},{"$f":"IF(Wst01_04=AIS_units21,IF(Wst01_01=AIS_No,AIS_No,IF(Wst01_05>=AL1795,AIS_Yes,AIS_No)),AIS_NA)","v":"N/A"}]
[null,null,null,null,null,null,null,null,null,null,null,null,null,null,null,null,null,null,null,null,null,null,null,"Exemp. level",1.6,1.9,null,null,null,"Demolition",{"$f":"IF(Wst01_15=AIS_NA,AIS_NA,IF(Wst01_04=AIS_units18,IF(OR(Wst01_01=AIS_No,Wst01_15=AIS_No),AIS_No,IF(Wst01_07>=AE1796,AIS_Yes,AIS_No)),AIS_NA))","v":{"$error":"#REF!"}},{"$f":"IF(Wst01_15=AIS_NA,AIS_NA,IF(Wst01_04=AIS_units21,IF(OR(Wst01_01=AIS_No,Wst01_15=AIS_No),AIS_No,IF(Wst01_07>=AF1796,AIS_Yes,AIS_No)),AIS_NA))","v":{"$error":"#REF!"}},null,null,null,"Demolition",{"$f":"IF(Wst01_15=AIS_NA,AIS_NA,IF(Wst01_04=AIS_units18,IF(OR(Wst01_01=AIS_No,Wst01_15=AIS_No),AIS_No,IF(Wst01_07>=AK1796,AIS_Yes,AIS_No)),AIS_NA))","v":{"$error":"#REF!"}},{"$f":"IF(Wst01_15=AIS_NA,AIS_NA,IF(Wst01_04=AIS_units21,IF(OR(Wst01_01=AIS_No,Wst01_15=AIS_No),AIS_No,IF(Wst01_07>=AL1796,AIS_Yes,AIS_No)),AIS_NA))","v":{"$error":"#REF!"}}]
[null,null,null,null,null,null,null,null,null,null,null,null,null,null,null,null,null,null,null,null,null,null,null,"Exemp. Result",{"$f":"IF(Wst01_02=\"\",\"\",IF(AND(Wst01_04=AIS_units18,Wst01_02<=Y1800),AIS_Yes))","v":false},{"$f":"IF(Wst01_02=\"\",\"\",IF(AND(Wst01_04=AIS_units21,Wst01_02<=Z1800),AIS_Yes))","v":false},null,null,null,"Result",{"$f":"IF(OR(AE1799=AIS_No,AE1800=AIS_No),0,IF(AND(AE1799=AIS_Yes,AE1800=AIS_Yes),Wst01_26,IF(AND(AE1799=AIS_Yes,AE1800=AIS_NA),Wst01_26)))","v":{"$error":"#REF!"}},{"$f":"IF(OR(AF1799=AIS_No,AF1800=AIS_No),0,IF(AND(AF1799=AIS_Yes,AF1800=AIS_Yes),Wst01_26,IF(AND(AF1799=AIS_Yes,AF1800=AIS_NA),Wst01_26)))","v":{"$error":"#REF!"}},null,null,null,"Result",{"$f":"IF(OR(AK1799=AIS_No,AK1800=AIS_No),0,IF(AND(AK1799=AIS_Yes,AK1800=AIS_Yes),AIS_Yes,IF(AND(AK1799=AIS_Yes,AK1800=AIS_NA),AIS_Yes)))","v":{"$error":"#REF!"}},{"$f":"IF(OR(AL1799=AIS_No,AL1800=AIS_No),0,IF(AND(AL1799=AIS_Yes,AL1800=AIS_Yes),AIS_Yes,IF(AND(AL1799=AIS_Yes,AL1800=AIS_NA),AIS_Yes)))","v":{"$error":"#REF!"}}]
[null,null,null,null,null,null,null,null,null,null,null,null,null,null,null,null,null,null,null,null,null,null,null,null,null,null,null,{"$f":"IF(J1026=Wst01_bel40,\"< 50% (by weight) or < 40% (by volume)\",IF(J1026=Wst01_abv40,\"< 10% improvement over national rate (up to 95%)\",\"\"))","v":"< 50% (by weight) or < 40% (by volume)"}]
[null,null,null,null,null,null,null,null,null,null,null,null,null,null,null,null,null,null,null,null,null,null,null,null,null,"<40% (by weight)",null,{"$f":"IF(J1026=Wst01_bel40,\"≥ 50% (by weight) or ≥ 40% (by volume)\",IF(J1026=Wst01_abv40,\"≥ 10% improvement over national rate (up to 95%)\",\"\"))","v":"≥ 50% (by weight) or ≥ 40% (by volume)"}]
[null,null,null,null,null,null,null,null,null,null,null,null,null,null,null,null,null,null,null,null,null,null,null,null,null,"≥40% (by weight)",null,{"$f":"IF(J1026=Wst01_bel40,\"≥ 75% (by weight) or ≥ 65% (by volume)\",IF(J1026=Wst01_abv40,\"≥ 35% improvement over national rate (up to 95%)\",\"\"))","v":"≥ 75% (by weight) or ≥ 65% (by volume)"}]
[null,null,null,null,null,null,null,null,null,null,null,null,null,null,null,null,null,null,null,null,null,null,null,"Wst02 data"]
[]
[]
[null,null,null,null,null,null,null,null,null,null,null,null,null,null,null,null,null,null,null,null,null,null,null,null,"Standard credits","Exemplary level","Result","Result",null,"Please select"]
[null,null,null,null,null,null,null,null,null,null,null,null,null,null,null,null,null,null,null,null,null,null,null,"Overall project",0.25,0.35,{"$f":"IF(Wst02_01>=Y1809,AIS_Yes,AIS_No)","v":"Yes"},{"$f":"IF(Wst02_01>=Z1809,AIS_Yes,AIS_No)","v":"Yes"},null,"Less than 25%"]
[null,null,null,null,null,null,null,null,null,null,null,null,null,null,null,null,null,null,null,null,null,null,null,"Structural frame",0.25,0.5,{"$f":"IF(Wst02_02=AIS_NA,AIS_NA,IF(Wst02_02>=Y1810,AIS_Yes,AIS_No))","v":{"$error":"#REF!"}},{"$f":"IF(Wst02_02=AIS_NA,AIS_NA,IF(Wst02_02>=Z1810,AIS_Yes,AIS_No))","v":{"$error":"#REF!"}},null,"At least 25%"]
[null,null,null,null,null,null,null,null,null,null,null,null,null,null,null,null,null,null,null,null,null,null,null,"Floor slabs including ground floor slabs",0.25,0.5,{"$f":"IF(Wst02_03=AIS_NA,AIS_NA,IF(Wst02_03>=Y1811,AIS_Yes,AIS_No))","v":{"$error":"#REF!"}},{"$f":"IF(Wst02_03=AIS_NA,AIS_NA,IF(Wst02_03>=Z1811,AIS_Yes,AIS_No))","v":{"$error":"#REF!"}},null,"At least 50%"]
[null,null,null,null,null,null,null,null,null,null,null,null,null,null,null,null,null,null,null,null,null,null,null,"Bitumen or hydraulically bound base, binder, and surface courses for paved areas and roads",0.5,0.75,{"$f":"IF(Wst02_04=AIS_NA,AIS_NA,IF(Wst02_04>=Y1812,AIS_Yes,AIS_No))","v":{"$error":"#REF!"}},{"$f":"IF(Wst02_04=AIS_NA,AIS_NA,IF(Wst02_04>=Z1812,AIS_Yes,AIS_No))","v":{"$error":"#REF!"}}]
[null,null,null,null,null,null,null,null,null,null,null,null,null,null,null,null,null,null,null,null,null,null,null,"Concrete road surfaces",0.25,0.5,{"$f":"IF(Wst02_05=AIS_NA,AIS_NA,IF(Wst02_05>=Y1813,AIS_Yes,AIS_No))","v":{"$error":"#REF!"}},{"$f":"IF(Wst02_05=AIS_NA,AIS_NA,IF(Wst02_05>=Z1813,AIS_Yes,AIS_No))","v":{"$error":"#REF!"}},null,{"$f":"IF(OR(Wst02_01=wst02_preopt3,Wst02_01=wst02_preopt2),1,0)","v":0}]
[null,null,null,null,null,null,null,null,null,null,null,null,null,null,null,null,null,null,null,null,null,null,null,"Pipe bedding",0.5,1,{"$f":"IF(Wst02_06=AIS_NA,AIS_NA,IF(Wst02_06>=Y1814,AIS_Yes,AIS_No))","v":{"$error":"#REF!"}},{"$f":"IF(Wst02_06=AIS_NA,AIS_NA,IF(Wst02_06>=Z1814,AIS_Yes,AIS_No))","v":{"$error":"#REF!"}}]
[null,null,null,null,null,null,null,null,null,null,null,null,null,null,null,null,null,null,null,null,null,null,null,"Building foundations",0.25,0.5,{"$f":"IF(Wst02_07=AIS_NA,AIS_NA,IF(Wst02_07>=Y1815,AIS_Yes,AIS_No))","v":{"$error":"#REF!"}},{"$f":"IF(Wst02_07=AIS_NA,AIS_NA,IF(Wst02_07>=Z1815,AIS_Yes,AIS_No))","v":{"$error":"#REF!"}}]
[null,null,null,null,null,null,null,null,null,null,null,null,null,null,null,null,null,null,null,null,null,null,null,"Granular fill and capping",0.75,1,{"$f":"IF(Wst02_08=AIS_NA,AIS_NA,IF(Wst02_08>=Y1816,AIS_Yes,AIS_No))","v":{"$error":"#REF!"}},{"$f":"IF(Wst02_08=AIS_NA,AIS_NA,IF(Wst02_08>=Z1816,AIS_Yes,AIS_No))","v":{"$error":"#REF!"}}]
[null,null,null,null,null,null,null,null,null,null,null,null,null,null,null,null,null,null,null,null,null,null,null,"Gravel landscaping",1,1,{"$f":"IF(Wst02_09=AIS_NA,AIS_NA,IF(Wst02_09>=Y1817,AIS_Yes,AIS_No))","v":{"$error":"#REF!"}},{"$f":"IF(Wst02_09=AIS_NA,AIS_NA,IF(Wst02_09>=Z1817,AIS_Yes,AIS_No))","v":{"$error":"#REF!"}}]
[]
[null,null,null,null,null,null,null,null,null,null,null,null,null,null,null,null,null,null,null,null,null,null,null,"Wst03 data"]
[]
[null,null,null,null,null,null,null,null,null,null,null,null,null,null,null,null,null,null,null,null,null,null,null,"Operational waste facilities compliant with HTM 07-01"]
[null,null,null,null,null,null,null,null,null,null,null,null,null,null,null,null,null,null,null,null,null,null,null,"A school recycling policy and outline of operational procedures"]
[null,null,null,null,null,null,null,null,null,null,null,null,null,null,null,null,null,null,null,null,null,null,null,"Internal and, if applicable, communal storage & home compost facilities"]
[]
[null,null,null,null,null,null,null,null,null,null,null,null,null,null,null,null,null,null,null,null,null,null,null,"Wst04 data"]
[]
[null,null,null,null,null,null,null,null,null,null,null,null,null,null,null,null,null,null,null,null,null,null,null,"Please select"]
[null,null,null,null,null,null,null,null,null,null,null,null,null,null,null,null,null,null,null,null,null,null,null,"The building's occupant(s)/tenant(s) will specifiy floor/ceiling finishes"]
[null,null,null,null,null,null,null,null,null,null,null,null,null,null,null,null,null,null,null,null,null,null,null,"Speculative floor and ceiling finishes will be installed in a show area only"]
[null,null,null,null,null,null,null,null,null,null,null,null,null,null,null,null,null,null,null,null,null,null,null,"Occupant/tenant specification, plus speculative finishes in show area"]
[null,null,null,null,null,null,null,null,null,null,null,null,null,null,null,null,null,null,null,null,null,null,null,"Occupant/tenant specification, plus no specified finishes in other areas"]
[null,null,null,null,null,null,null,null,null,null,null,null,null,null,null,null,null,null,null,null,null,null,null,"No speculative floor or ceiling finishes will be specified in the building"]
[null,null,null,null,null,null,null,null,null,null,null,null,null,null,null,null,null,null,null,null,null,null,null,"Speculative floor and ceiling finishes will be installed (i.e. non-compliant)"]
[null,null,null,null,null,null,null,null,null,null,null,null,null,null,null,null,null,null,null,null,null,null,null,"LE01 data"]
[]
[null,null,null,null,null,null,null,null,null,null,null,null,null,null,null,null,null,null,null,null,null,null,null,"Please select"]
[null,null,null,null,null,null,null,null,null,null,null,null,null,null,null,null,null,null,null,null,null,null,null,"Less than 75%"]
[null,null,null,null,null,null,null,null,null,null,null,null,null,null,null,null,null,null,null,null,null,null,null,"At least 75%"]
[null,null,null,null,null,null,null,null,null,null,null,null,null,null,null,null,null,null,null,null,null,null,null,"At least 95%"]
[]
[null,null,null,null,null,null,null,null,null,null,null,null,null,null,null,null,null,null,null,null,null,null,null,"LE02 data"]
[]
[null,null,null,null,null,null,null,null,null,null,null,null,null,null,null,null,null,null,null,null,null,null,null,"Please select"]
[null,null,null,null,null,null,null,null,null,null,null,null,null,null,null,null,null,null,null,null,null,null,null,"The BREEAM checklist"]
[null,null,null,null,null,null,null,null,null,null,null,null,null,null,null,null,null,null,null,null,null,null,null,"A Suitably Qualified Ecologist"]
[]
[null,null,null,null,null,null,null,null,null,null,null,null,null,null,null,null,null,null,null,null,null,null,null,"LE03 data"]
[]
[null,null,null,null,null,null,null,null,null,null,null,null,null,null,null,null,null,null,null,null,null,null,null,"Please select"]
[null,null,null,null,null,null,null,null,null,null,null,null,null,null,null,null,null,null,null,null,null,null,null,"Suitably Qualified Ecologist site survey of plant species",null,0,null,2]
[null,null,null,null,null,null,null,null,null,null,null,null,null,null,null,null,null,null,null,null,null,null,null,"Assessor's classification of broad habitat type(s) using BREEAM",null,-9,null,1]
[]
[]
[]
[]
[null,null,null,null,null,null,null,null,null,null,null,null,null,null,null,null,null,null,null,null,null,null,null,"LE04 data"]
[]
[null,null,null,null,null,null,null,null,null,null,null,null,null,null,null,null,null,null,null,null,null,null,null,null,1,"Please select"]
[null,null,null,null,null,null,null,null,null,null,null,null,null,null,null,null,null,null,null,null,null,null,null,0,2,"At least 50%"]
[null,null,null,null,null,null,null,null,null,null,null,null,null,null,null,null,null,null,null,null,null,null,null,6,3,"At least 75%"]
[null,null,null,null,null,null,null,null,null,null,null,null,null,null,null,null,null,null,null,null,null,null,null,null,null,"At least 95%"]
[null,null,null,null,null,null,null,null,null,null,null,null,null,null,null,null,null,null,null,null,null,null,null,"LE05 data"]
[]
[null,null,null,null,null,null,null,null,null,null,null,null,null,null,null,null,null,null,null,null,null,null,null,"Applicable criteria check, OK?",{"$f":"IF(OR(LE05_03=\"\",LE05_04=\"\",LE05_05=\"\",LE05_06=\"\",LE05_07=\"\",LE05_08=\"\"),AIS_Missing_data,IF(OR(LE05_03=\"\",LE05_04=\"\",LE05_05=\"\",LE05_06=\"\",LE05_07=\"\"),AIS_Missing_data,AIS_Yes))","v":"Yes"},null,null,null,null,"All buildings except prisons - additional criteria overall benchmarks",null,null,null,"Prison buildings - additional criteria overall benchmarks"]
[null,null,null,null,null,null,null,null,null,null,null,null,null,null,null,null,null,null,null,null,null,null,null,"Applicable criteria",{"$f":"IF(LE05_12=AIS_Yes,COUNTA(LE05_range01)-COUNTIF(LE05_range01,AIS_NA),IF(LE05_12=AIS_Yes,COUNTA(LE05_range02)-COUNTIF(LE05_range02,AIS_NA),AIS_Missing_data))","v":6},null,null,null,null,"Applicable criteria/Credits",1,2,null,"Applicable criteria/Credits",1,2,3]
[null,null,null,null,null,null,null,null,null,null,null,null,null,null,null,null,null,null,null,null,null,null,null,"Compliant criteria",{"$f":"IF(LE05_11=AIS_Missing_data,AIS_Missing_data,COUNTIF(LE05_range02,AIS_Yes))","v":0},null,null,null,null,1,1,1,null,1,1,1,1]
[null,null,null,null,null,null,null,null,null,null,null,null,null,null,null,null,null,null,null,null,null,null,null,null,null,null,null,null,null,2,2,2,null,2,2,2,2]
[null,null,null,null,null,null,null,null,null,null,null,null,null,null,null,null,null,null,null,null,null,null,null,"Credits",{"$f":"IF(AND(LE05_11=0,LE05_02=AIS_Yes),LE05_09,VLOOKUP(LE05_13,LE05_range04,2,TRUE))","v":0},null,null,null,null,3,2,3,null,3,1,2,3]
[null,null,null,null,null,null,null,null,null,null,null,null,null,null,null,null,null,null,null,null,null,null,null,null,null,null,null,null,null,4,2,4,null,4,2,3,3]
[null,null,null,null,null,null,null,null,null,null,null,null,null,null,null,null,null,null,null,null,null,null,null,null,null,null,null,null,null,5,2,4,null,5,2,3,4]
[null,null,null,null,null,null,null,null,null,null,null,null,null,null,null,null,null,null,null,null,null,null,null,null,null,null,null,null,null,6,2,4]
[null,null,null,null,null,null,null,null,null,null,null,null,null,null,null,null,null,null,null,null,null,null,null,"LE06 data"]
[null,null,null,null,null,null,null,null,null,null,null,null,null,null,null,null,null,null,null,null,null,null,null,null,null,null,null,null,null,"All buildings except prisons - applicable criteria benchmarks",null,null,null,"Applicable criteria","Credits"]
[null,null,null,null,null,null,null,null,null,null,null,null,null,null,null,null,null,null,null,null,null,null,null,null,"House",{"$f":"IF(LE6_building=LE6_house,\"<2.5:1\",\"<3:1\")","v":"<3:1"},null,null,null,"Applicable criteria","Credits",null,null,0,0]
[null,null,null,null,null,null,null,null,null,null,null,null,null,null,null,null,null,null,null,null,null,null,null,null,"Flat",{"$f":"IF(LE6_building=LE6_house,\"≥2.5:1\",\"≥3:1\")","v":"≥3:1"},null,null,null,0,0,null,null,{"$f":"VLOOKUP(LE05_11,LE05_range05,2,FALSE)","v":{"$error":"#N/A"}},1]
[null,null,null,null,null,null,null,null,null,null,null,null,null,null,null,null,null,null,null,null,null,null,null,null,null,{"$f":"IF(LE6_building=LE6_house,\"≥3:1\",\"≥4:1\")","v":"≥4:1"},null,null,null,{"$f":"VLOOKUP(LE05_11,LE05_range03,2,FALSE)","v":2},1,null,null,{"$f":"VLOOKUP(LE05_11,LE05_range05,3,FALSE)","v":{"$error":"#N/A"}},2]
[null,null,null,null,null,null,null,null,null,null,null,null,null,null,null,null,null,null,null,null,null,null,null,null,null,null,null,null,null,{"$f":"VLOOKUP(LE05_11,LE05_range03,3,FALSE)","v":4},2,null,null,{"$f":"VLOOKUP(LE05_11,LE05_range05,4,FALSE)","v":{"$error":"#N/A"}},3]
[]
[null,null,null,null,null,null,null,null,null,null,null,null,null,null,null,null,null,null,null,null,null,null,null,"Pol01 data"]
[]
[null,null,null,null,null,null,null,null,null,null,null,null,null,null,null,null,null,null,null,null,null,null,null,0,2,"<100"]
[null,null,null,null,null,null,null,null,null,null,null,null,null,null,null,null,null,null,null,null,null,null,null,100,2,">100-<1000"]
[null,null,null,null,null,null,null,null,null,null,null,null,null,null,null,null,null,null,null,null,null,null,null,1000,1,">1000"]
[null,null,null,null,null,null,null,null,null,null,null,null,null,null,null,null,null,null,null,null,null,null,null,"Credits (pt.1)",{"$f":"IF(Pol01_02=AIS_No,Pol01_03,0)","v":0}]
[null,null,null,null,null,null,null,null,null,null,null,null,null,null,null,null,null,null,null,null,null,null,null,null,{"$f":"IF(Pol01_02=AIS_No,Pol01_03,IF(AND(Pol01_02=AIS_Yes,Pol01_06=AIS_Yes),Pol01_14,IF(AND(Pol01_02=AIS_Yes,Pol01_06=AIS_No),Pol01_25,0)))","v":0}]
[null,null,null,null,null,null,null,null,null,null,null,null,null,null,null,null,null,null,null,null,null,null,null,null,{"$f":"IF(Pol01_07=Pol01_preopt1,2,IF(Pol01_07=Pol01_preopt2,1,0))","v":0}]
[]
[null,null,null,null,null,null,null,null,null,null,null,null,null,null,null,null,null,null,null,null,null,null,null,"Pol02 data"]
[]
[null,null,null,null,null,null,null,null,null,null,null,null,null,null,null,null,null,null,null,null,null,null,null,null,null,null,null,null,null,"Education, healthcare, multi-residential, prison building types and other residential"]
[null,null,null,null,null,null,null,null,null,null,null,null,null,null,null,null,null,null,null,null,null,null,null,"Court, office, retail and other building type",null,null,{"$f":"IF(Pol02_30=AIS_Yes,IF(Pol02_23=AIS_option02,0.5,IF(Pol02_23=AIS_option04,0,1)),Pol02_result)","v":{"$error":"#NAME?"}},null,null,"Heating",0,3,null,"Industrial","Benchmark","Applicable","Credits","Achieved"]
[null,null,null,null,null,null,null,null,null,null,null,null,null,null,null,null,null,null,null,null,null,null,null,0,3,null,{"$f":"IF(Pol02_30=AIS_Yes,IF(Pol02_23=AIS_option02,0.5,IF(Pol02_23=AIS_option04,0,1)),IF(Pol02_23=AIS_option02,Pol02_result*0.5,IF(Pol02_23=AIS_option04,0,IF(Pol02_result=3,IF(Pol02_25=AIS_option04,2,IF(Pol02_25=AIS_option02,2.5,Pol02_result)),Pol02_result))))","v":{"$error":"#REF!"}},null,null,"Heating",40,3,null,"Office and associated areas (space heating & cooling)",70,{"$f":"IF(ADIND_option01=AD_Yes,AIS_Yes,AIS_No)","v":{"$error":"#REF!"}},1,{"$f":"IF(Pol02_20=\"\",0,IF(AND(Pol02_07=AIS_Yes,Pol02_20<=Pol02_05),Pol02_09,0))","v":0}]
[null,null,null,null,null,null,null,null,null,null,null,null,null,null,null,null,null,null,null,null,null,null,null,40,3,null,null,null,null,"Heating",40.01,2,null,"Operational areas (space heating & cooling)",70,{"$f":"IF(ADIND_option02=AD_Yes,AIS_Yes,AIS_No)","v":"No"},1,{"$f":"IF(Pol02_20=\"\",0,IF(AND(Pol02_08=AIS_Yes,Pol02_20<=Pol02_06),Pol02_10,0))","v":0}]
[null,null,null,null,null,null,null,null,null,null,null,null,null,null,null,null,null,null,null,null,null,null,null,40.01,2,null,"Yes",null,null,"Heating",70,2]
[null,null,null,null,null,null,null,null,null,null,null,null,null,null,null,null,null,null,null,null,null,null,null,70,2,null,"N/A",null,null,"Heating",70.010000000000005,1,null,null,{"$f":"Pol02_11+Pol02_12","v":0}]
[null,null,null,null,null,null,null,null,null,null,null,null,null,null,null,null,null,null,null,null,null,null,null,70.010000000000005,1,null,null,null,null,"Heating",100,1]
[null,null,null,null,null,null,null,null,null,null,null,null,null,null,null,null,null,null,null,null,null,null,null,100,1,null,null,null,null,"Heating",100.01,0,null,null,null,null,"N/A"]
[null,null,null,null,null,null,null,null,null,null,null,null,null,null,null,null,null,null,null,null,null,null,null,100.01,0,null,null,null,null,"Water",100,null,null,{"$f":"IF(Pol02_30=AA1900,120,100)","v":100},1,null,{"$f":"IF(Pol02_30=AA1900,2,4)","v":4}]
[null,null,null,null,null,null,null,null,null,null,null,null,null,null,null,null,null,null,null,null,null,null,null,{"$f":"IF(OR(Pol02_20=\"\",Pol02_20=\"NA\",Pol02_20=\"INA\"),0,VLOOKUP(Pol02_20,Pol02_benchmark01,2,TRUE))","v":0},null,null,"≤70",null,"Space heating/cooling ",{"$f":"IF(OR(Pol02_20=\"\",Pol02_20=\"NA\",Pol02_20=\"INA\"),0,IF(Pol02_20=\"\",0,VLOOKUP(Pol02_20,Pol02_benchmark02,2,TRUE)))","v":0},null,null,null,{"$f":"IF(Pol02_30=AA1900,80,70)","v":70},2,null,{"$f":"IF(Pol02_30=AA1900,3,5)","v":5}]
[null,null,null,null,null,null,null,null,null,null,null,null,null,null,null,null,null,null,null,null,null,null,null,null,null,null,">70",null,"Water heating compliant",{"$f":"IF(OR(Pol02_21=AIS_units22,Pol02_21=\"\"),AIS_No,IF(OR(Pol02_21<=Pol02_02,Pol02_21=AIS_NA),AIS_Yes,AIS_No))","v":"No"},null,null,null,{"$f":"IF(Pol02_30=AA1900,50,40)","v":40},3]
[null,null,null,null,null,null,null,null,null,null,null,null,null,null,null,null,null,null,null,null,null,null,null,{"$f":"IF(OR(ADBT0=ADBT1,ADBT0=ADBT3,ADBT0=ADBT7,ADBT0=ADBT10,ADBT0=ADBT11,ADBT0=ADBT12),Pol02_result01,IF(OR(ADBT0=ADBT4,ADBT0=ADBT5,ADBT0=ADBT6,ADBT0=ADBT8,ADBT0=ADBT9),Pol02_result02,IF(ADBT0=ADBT2,Pol02_result03)))","v":{"$error":"#NAME?"}}]
[null,null,null,null,null,null,null,null,null,null,null,null,null,null,null,null,null,null,null,null,null,null,null,null,null,null,null,null,null,{"$f":"IF(AND(Pol02_03=3,Pol02_04=AIS_Yes),Pol02_03,IF(AND(Pol02_03=3,Pol02_04=AIS_No),2,Pol02_03))","v":0}]
[]
[]
[null,null,null,null,null,null,null,null,null,null,null,null,null,null,null,null,null,null,null,null,null,null,null,"Pol03 data"]
[]
[null,null,null,null,null,null,null,null,null,null,null,null,null,null,null,null,null,null,null,null,null,null,null,"Please select"]
[null,null,null,null,null,null,null,null,null,null,null,null,null,null,null,null,null,null,null,null,null,null,null,"Low"]
[null,null,null,null,null,null,null,null,null,null,null,null,null,null,null,null,null,null,null,null,null,null,null,"Medium"]
[null,null,null,null,null,null,null,null,null,null,null,null,null,null,null,null,null,null,null,null,null,null,null,"High"]
[null,null,null,null,null,null,null,null,null,null,null,null,null,null,null,null,null,null,null,null,null,null,null,"Floodplain"]
[null,null,null,null,null,null,null,null,null,null,null,null,null,null,null,null,null,null,null,null,null,null,null,"Not defined"]
[]
[null,null,null,null,null,null,null,null,null,null,null,null,null,null,null,null,null,null,null,null,null,null,null,"Error checking (for Excel 2003)"]
[null,null,null,null,null,null,null,null,null,null,null,null,null,null,null,null,null,null,null,null,null,null,null,"Man01_Tot",{"$f":"SUM(N25:N33)","v":0}]
[null,null,null,null,null,null,null,null,null,null,null,null,null,null,null,null,null,null,null,null,null,null,null,"Man02_Tot",{"$f":"IF(OR(Man02_01=AIS_option25,Man02_01=AIS_option07,Man02_01=AIS_option08),0,VLOOKUP(Man02_14,Man02_CCSscheme_Standard_benchmarks,2,FALSE))","v":0}]
[null,null,null,null,null,null,null,null,null,null,null,null,null,null,null,null,null,null,null,null,null,null,null,"Man03_KPI09",{"$f":"(Man03_KPI08/Man03_KPI07)","v":{"$error":"#DIV/0!"}}]
[null,null,null,null,null,null,null,null,null,null,null,null,null,null,null,null,null,null,null,null,null,null,null,"Man03_KPI14",{"$f":"(Man03_KPI13/Man03_kPI12)","v":{"$error":"#DIV/0!"}}]
[null,null,null,null,null,null,null,null,null,null,null,null,null,null,null,null,null,null,null,null,null,null,null,"Man03_KPI11",{"$f":"(Man03_KPI10/Man03_KPI07)","v":{"$error":"#DIV/0!"}}]
[null,null,null,null,null,null,null,null,null,null,null,null,null,null,null,null,null,null,null,null,null,null,null,"Man03_KPI16",{"$f":"(Man03_KPI15/Man03_kPI12)","v":{"$error":"#DIV/0!"}}]
[null,null,null,null,null,null,null,null,null,null,null,null,null,null,null,null,null,null,null,null,null,null,null,"Man03_Tot",{"$f":"SUM(N76:N81)","v":0}]
[null,null,null,null,null,null,null,null,null,null,null,null,null,null,null,null,null,null,null,null,null,null,null,"Man04_Tot",{"$f":"SUM(N122:N125)+SUM(N128:N131)","v":0}]
[null,null,null,null,null,null,null,null,null,null,null,null,null,null,null,null,null,null,null,null,null,null,null,"Man05_Tot",{"$f":"SUM(N151:N153)","v":0}]
[null,null,null,null,null,null,null,null,null,null,null,null,null,null,null,null,null,null,null,null,null,null,null,"Hea01_Tot",{"$f":"IF(Hea01_01=AIS_No,0,SUM(N176:N178))","v":0}]
[null,null,null,null,null,null,null,null,null,null,null,null,null,null,null,null,null,null,null,null,null,null,null,"Hea02_Tot",{"$f":"IF(AND(ADIND_option03=AD_no,ADBT0=ADBT2),AIS_NA,(SUM(N199:N203)))","v":0}]
[null,null,null,null,null,null,null,null,null,null,null,null,null,null,null,null,null,null,null,null,null,null,null,"Hea03_Tot",{"$f":"IF(AND(ADIND_option03=AD_no,ADBT0=ADBT2),AIS_NA,(SUM(N232:N233)))","v":0}]
[null,null,null,null,null,null,null,null,null,null,null,null,null,null,null,null,null,null,null,null,null,null,null,"Hea05_Tot",{"$f":"IF((ADBT0=ADBT8),Hea05_08b,SUM(Hea05_05+Hea05_06))","v":0}]
[null,null,null,null,null,null,null,null,null,null,null,null,null,null,null,null,null,null,null,null,null,null,null,"Hea06_Tot",{"$f":"SUM(N305:N305)","v":0}]
[null,null,null,null,null,null,null,null,null,null,null,null,null,null,null,null,null,null,null,null,null,null,null,"Hea07_Tot",{"$f":"N325","v":0}]
[null,null,null,null,null,null,null,null,null,null,null,null,null,null,null,null,null,null,null,null,null,null,null,"Hea08_Tot",{"$f":"IF(ADBT0=ADBT8,N345,0)","v":0}]
[null,null,null,null,null,null,null,null,null,null,null,null,null,null,null,null,null,null,null,null,null,null,null,"Ene01_08",{"$f":"ROUND(1-(Ene01_07/Ene01_06),4)","v":{"$error":"#DIV/0!"}}]
[null,null,null,null,null,null,null,null,null,null,null,null,null,null,null,null,null,null,null,null,null,null,null,"Ene01_50",{"$f":"ROUND(1-(Ene01_49/Ene01_48),4)","v":{"$error":"#DIV/0!"}}]
[null,null,null,null,null,null,null,null,null,null,null,null,null,null,null,null,null,null,null,null,null,null,null,"Ene02_Tot",{"$f":"Ene02_06+Ene02_07+N440+N441","v":0}]
[null,null,null,null,null,null,null,null,null,null,null,null,null,null,null,null,null,null,null,null,null,null,null,"Ene04_Tot",{"$f":"N483+N484","v":0}]
[null,null,null,null,null,null,null,null,null,null,null,null,null,null,null,null,null,null,null,null,null,null,null,"Ene04_20",{"$f":"((IF(Score_option=_PSc2,Ene04_19/Ene04_credits*Ene04_user,Ene04_19/Ene04_credits*Ene04_tot)))","v":0}]
[null,null,null,null,null,null,null,null,null,null,null,null,null,null,null,null,null,null,null,null,null,null,null,"Ene05_Tot",{"$f":"+Ene05_07+Ene05_08+Ene05_09","v":0}]
[null,null,null,null,null,null,null,null,null,null,null,null,null,null,null,null,null,null,null,null,null,null,null,"Ene06_Tot",{"$f":"IF(AD_Trans=AD_no,AIS_NA,Ene06_05+Ene06_06)","v":0}]
[null,null,null,null,null,null,null,null,null,null,null,null,null,null,null,null,null,null,null,null,null,null,null,"Ene07_Tot",{"$f":"IF(Ene07_01=AIS_statement32,AIS_NA,IF(Ene07_04=AIS_NA,Ene07_09,IF(Ene07_09=AIS_NA,Ene07_05,Ene07_05+Ene07_09)))","v":"N/A"}]
[null,null,null,null,null,null,null,null,null,null,null,null,null,null,null,null,null,null,null,null,null,null,null,"Ene09_Tot",{"$f":"IF(OR(ADBT0=ADBT8,ADBT0=ADBT9),Ene09_03,AIS_NA)","v":"N/A"}]
[null,null,null,null,null,null,null,null,null,null,null,null,null,null,null,null,null,null,null,null,null,null,null,"Tra01_07",{"$f":"(BP_35/BP_04)*Tra01_credits","v":{"$error":"#VALUE!"}}]
[null,null,null,null,null,null,null,null,null,null,null,null,null,null,null,null,null,null,null,null,null,null,null,"Tra01_Tot",{"$f":"IF(Tra01_05>0,Tra01_05,Tra01_06)","v":0}]
[null,null,null,null,null,null,null,null,null,null,null,null,null,null,null,null,null,null,null,null,null,null,null,"Tra01_08",{"$f":"IF(Score_option=_PSc2,(Tra01_07/Tra01_credits)*Tra01_user,(Tra01_07/Tra01_credits)*Tra01_tot)","v":{"$error":"#VALUE!"}}]
[null,null,null,null,null,null,null,null,null,null,null,null,null,null,null,null,null,null,null,null,null,null,null,"Tra02_06",{"$f":"IF(Tra02_05=AIS_statement32,AIS_NA,(BP_35/BP_04)*Tra02_credits)","v":{"$error":"#VALUE!"}}]
[null,null,null,null,null,null,null,null,null,null,null,null,null,null,null,null,null,null,null,null,null,null,null,"Tra02_Tot",{"$f":"IF(ADBT0=ADBT6,AIS_NA,IF(Tra02_03=\"\",0,IF(Tra02_01=AIS_No,0,Tra02_03)))","v":{"$error":"#NAME?"}}]
[null,null,null,null,null,null,null,null,null,null,null,null,null,null,null,null,null,null,null,null,null,null,null,"Tra02_07",{"$f":"IF(Tra02_05=AIS_statement32,AIS_NA,IF(Score_option=_PSc2,Tra02_06/Tra02_credits*Tra02_user,Tra02_06/Tra02_credits*Tra02_tot))","v":{"$error":"#VALUE!"}}]
[null,null,null,null,null,null,null,null,null,null,null,null,null,null,null,null,null,null,null,null,null,null,null,"Tra03_13",{"$f":"(BP_35/BP_04)*Tra03_credits","v":{"$error":"#VALUE!"}}]
[null,null,null,null,null,null,null,null,null,null,null,null,null,null,null,null,null,null,null,null,null,null,null,"Tra03_Tot",{"$f":"Tra03_09+Tra03b_09","v":0}]
[null,null,null,null,null,null,null,null,null,null,null,null,null,null,null,null,null,null,null,null,null,null,null,"Tra03_14",{"$f":"IF(Tra03_tot=AIS_statement49,AIS_statement49,IF(Score_option=_PSc2,Tra03_13/Tra03_credits*Tra03_user,Tra03_13/Tra03_credits*Tra03_tot))","v":{"$error":"#VALUE!"}}]
[null,null,null,null,null,null,null,null,null,null,null,null,null,null,null,null,null,null,null,null,null,null,null,"Tra04_09",{"$f":"IF(Tra04_07=AIS_statement32,AIS_NA,(BP_35/BP_04)*Tra04_credits)","v":{"$error":"#VALUE!"}}]
[null,null,null,null,null,null,null,null,null,null,null,null,null,null,null,null,null,null,null,null,null,null,null,"Tra04_Tot",{"$f":"IF(Tra04_option=Tra04_1cr,1,IF(Tra04_option=Tra04_2cr,2,0))","v":0}]
[null,null,null,null,null,null,null,null,null,null,null,null,null,null,null,null,null,null,null,null,null,null,null,"Tra04_10",{"$f":"IF(Tra04_07=AIS_statement32,AIS_NA,IF(Score_option=_PSc2,Tra04_09/Tra04_credits*Tra04_user,Tra04_09/Tra04_credits*Tra04_tot))","v":{"$error":"#VALUE!"}}]
[null,null,null,null,null,null,null,null,null,null,null,null,null,null,null,null,null,null,null,null,null,null,null,"Tra05_04",{"$f":"(BP_35/BP_04)*Tra05_credits","v":{"$error":"#VALUE!"}}]
[null,null,null,null,null,null,null,null,null,null,null,null,null,null,null,null,null,null,null,null,null,null,null,"Tra05_05",{"$f":"IF(Score_option=_PSc2,Tra05_04/Tra05_credits*Tra05_user,Tra05_04/Tra05_credits*Tra05_tot)","v":{"$error":"#VALUE!"}}]
[null,null,null,null,null,null,null,null,null,null,null,null,null,null,null,null,null,null,null,null,null,null,null,"Tra06_04",{"$f":"(BP_35/BP_04)*Tra06_credits","v":{"$error":"#VALUE!"}}]
[null,null,null,null,null,null,null,null,null,null,null,null,null,null,null,null,null,null,null,null,null,null,null,"Tra06_05",{"$f":"IF(BP_04=AIS_statement49,0,IF(Score_option=_PSc2,BP_35/BP_04*Tra06_user,BP_35/BP_04*Tra06_tot))","v":0}]
[null,null,null,null,null,null,null,null,null,null,null,null,null,null,null,null,null,null,null,null,null,null,null,"Wat01_Tot",{"$f":"IF(AND(ADPT=ADPT02,Wat01_12=AIS_option02a),0,IF(AND(ADPT=ADPT04,Wat01_12=AIS_option02a),0,(IF(OR(Wat01_10=Wat01_exemplary,Wat01_10=Wat01_5cr),5,IF(Wat01_10=Wat01_4cr,4,IF(Wat01_10=Wat01_3cr,3,IF(Wat01_10=Wat01_2cr,2,IF(Wat01_10=Wat01_1cr,1,0))))))))","v":0}]
[null,null,null,null,null,null,null,null,null,null,null,null,null,null,null,null,null,null,null,null,null,null,null,"Wat01_15",{"$f":"IF(Score_option=_PSc2,(Wat01_14/Wat01_credits)*Wat01_user,(Wat01_14/Wat01_credits)*Wat01_tot)","v":0}]
[null,null,null,null,null,null,null,null,null,null,null,null,null,null,null,null,null,null,null,null,null,null,null,"Wat04_Tot",{"$f":"IF(Wat04_01=AIS_statement32,AIS_NA,Wat04_04)","v":0}]
[null,null,null,null,null,null,null,null,null,null,null,null,null,null,null,null,null,null,null,null,null,null,null,"Mat03_03",{"$f":"IF(Mat03_errorcheck>0,AIS_Error,SUM(Mat03_totalpoints)/(4*(COUNTIF(Mat03_elementapp,AIS_Yes))))","v":{"$error":"#DIV/0!"}}]
[null,null,null,null,null,null,null,null,null,null,null,null,null,null,null,null,null,null,null,null,null,null,null,"Mat03_05",{"$f":"IF(Mat03_prereq=AIS_Yes,VLOOKUP(Mat03_03,Mat03_credit_benchmarks,2,TRUE),0)","v":0}]
[null,null,null,null,null,null,null,null,null,null,null,null,null,null,null,null,null,null,null,null,null,null,null,"Wst01_Tot",{"$f":"IF(J1020=\"\",0,Y1972+Y1973+Y1974)","v":0}]
[null,null,null,null,null,null,null,null,null,null,null,null,null,null,null,null,null,null,null,null,null,null,null,"Wst01_17",{"$f":"Y1976","v":0}]
[null,null,null,null,null,null,null,null,null,null,null,null,null,null,null,null,null,null,null,null,null,null,null,"Wst02_Tot",{"$f":"IF(Wst02_01>=0.25,1,0)","v":1}]
[null,null,null,null,null,null,null,null,null,null,null,null,null,null,null,null,null,null,null,null,null,null,null,"Wst04_Tot",{"$f":"IF(Wst04_01=AIS_statement32,AIS_NA,Wst05_06)","v":"N/A"}]
[null,null,null,null,null,null,null,null,null,null,null,null,null,null,null,null,null,null,null,null,null,null,null,"LE03_Tot",{"$f":"IF(LE03_03=\"\",0,IF(LE03_03>=LE03_05,LE03_subtot,IF(LE03_03>=LE03_06,LE03_08,0)))","v":{"$error":"#REF!"}}]
[null,null,null,null,null,null,null,null,null,null,null,null,null,null,null,null,null,null,null,null,null,null,null,"Pol01_Tot",{"$f":"IF(Pol01_01=AIS_statement32,AIS_NA,IF(Pol01_02=AIS_No,Pol01_credits,Pol01_04+Pol01_10+Pol01_24+Pol01_23))","v":0}]
[null,null,null,null,null,null,null,null,null,null,null,null,null,null,null,null,null,null,null,null,null,null,null,"Pol03_Tot",{"$f":"Pol03_10+Pol03_11+Pol03_12+Pol03_13","v":0}]
[null,null,null,null,null,null,null,null,null,null,null,null,null,null,null,null,null,null,null,null,null,null,null,"Pol05_Tot",{"$f":"IF(Pol05_09=AIS_statement32,AIS_NA,Pol05_06)","v":0}]
[null,null,null,null,null,null,null,null,null,null,null,null,null,null,null,null,null,null,null,null,null,null,null,"Inn01_Tot",{"$f":"IF((SUM(Inn01_03)+Inn01_01)>10,10,(SUM(Inn01_03)+Inn01_01))","v":0}]
[null,null,null,null,null,null,null,null,null,null,null,null,null,null,null,null,null,null,null,null,null,null,null,"Ene01_Tot",{"$f":"IF(H372=X1620,H408,IF(OR(H372=X1619,ADBT0=ADBT1,ADBT0=ADBT2,ADBT0=ADBT3),IF(AND(ENE01_IntLighting=AIS_Yes),Ene01_74,IF(AND(ENE01_IntLighting=AIS_No,ADBT0=ADBT8),AD1620,AD1621))))","v":0}]
[null,null,null,null,null,null,null,null,null,null,null,null,null,null,null,null,null,null,null,null,null,null,null,"Ene01_tot_Plus_lighting",{"$f":"Ene01_Light_credits+Ene01_Tot_Err","v":0}]
[null,null,null,null,null,null,null,null,null,null,null,null,null,null,null,null,null,null,null,null,null,null,null,"Wst01_1st",{"$f":"IF(Wst01_11=AIS_Yes,1,0)","v":0}]
[null,null,null,null,null,null,null,null,null,null,null,null,null,null,null,null,null,null,null,null,null,null,null,"Wst01_2nd",{"$f":"IF(AND(Wst01_11=AIS_Yes,J1024=AIS_Yes),1,0)","v":0}]
[null,null,null,null,null,null,null,null,null,null,null,null,null,null,null,null,null,null,null,null,null,null,null,"Wst01_3rd",{"$f":"IF(OR(J1028=Wst01_3rdcr,J1028=Wst01_Inn1),1,0)","v":0}]
[]
[null,null,null,null,null,null,null,null,null,null,null,null,null,null,null,null,null,null,null,null,null,null,null,"Wst01_Inn1st",{"$f":"IF(AND(Y1972=1,Y1973=1,J1028=Wst01_Inn1,J1031<>\"\"),1,0)","v":0}]
[null,null,null,null,null,null,null,null,null,null,null,null,null,null,null,null,null,null,null,null,null,null,null,"Wst02_Inn1st",{"$f":"IF(Wst02_01>=0.5,1,0)","v":1}]
[]
[null,null,null,null,null,null,null,null,null,null,null,null,null,null,null,null,null,null,null,null,null,null,null,"Pol02_Nox",{"$f":"IF(OR(Pol02_20=\"\",Pol02_21=\"\"),0,IF(MAX(Pol02_20,Pol02_21)<=AH1900,3,IF(MAX(Pol02_20,Pol02_21)<=AH1899,2,IF(MAX(Pol02_20,Pol02_21)<=AH1898,1,0))))","v":0}]
[null,null,null,null,null,null,null,null,null,null,null,null,null,null,null,null,null,null,null,null,null,null,null,"Pol02_Eur",{"$f":"IF(J1271=AIS_NA,0,IF(J1271=AK1899,2,IF(J1271=AK1898,1,0)))","v":0}]
[null,null,null,null,null,null,null,null,null,null,null,null,null,null,null,null,null,null,null,null,null,null,null,"Pol02_Score",{"$f":"MAX(Pol02_Nox_Val,Pol02_Eur_Val)","v":0}]

{"sheet":"Assessment Data","index":3,"n_rows":16,"n_cols":218,"rows_kept":16,"cut":false,"hidden":true,"merged":[]}
[]
[null,null,null,null,null,null,null,null,null,null,null,null,null,null,null,null,null,null,null,null,null,null,null,null,null,null,null,null,null,null,null,null,null,null,null,null,null,null,null,null,null,null,null,null,null,null,null,null,null,null,null,null,null,null,null,null,null,null,null,null,null,{"$f":"'Simple Scoring Approach'!B15","v":"Energy (consumption/production)"},null,null,null,null,null,null,null,{"$f":"'Simple Scoring Approach'!B25","v":"Greenhouse Gas Emissions"},null,null,null,null,null,null,null,null,null,null,{"$f":"'Simple Scoring Approach'!B38","v":"Emissions to outdoor air, soil and water"},null,{"$f":"'Simple Scoring Approach'!B41","v":"Use of freshwater resource "},null,null,null,{"$f":"'Simple Scoring Approach'!B46","v":"Construction waste and recovery"},null,null,null,null,null,null,null,null,null,null,null,null,null,null,null,{"$f":"'Simple Scoring Approach'!B63","v":"Sourcing of materials"},{"$f":"'Simple Scoring Approach'!B66","v":"Thermal comfort"},{"$f":"'Simple Scoring Approach'!B70","v":"Indoor Air Quality"}]
[{"$f":"'Assessment Details'!B5","v":"General information"},null,null,null,null,{"$f":"'Assessment Details'!B20","v":"Building details"},null,null,null,null,null,null,null,null,null,null,null,null,null,null,null,null,null,null,null,null,null,null,null,null,null,null,null,null,null,null,null,null,null,{"$f":"'Assessment Details'!B105","v":"Project team details"},null,null,null,null,null,null,null,null,null,{"$f":"'Simple Scoring Approach'!B4","v":"Overall Building Performance"},null,{"$f":"'Simple Scoring Approach'!#REF!","v":{"$error":"#REF!"}},null,null,null,null,null,null,null,null,null,{"$f":"'Simple Scoring Approach'!F17","v":"Building operation[1]"},null,{"$f":"'Simple Scoring Approach'!F19","v":"Energy production[2]"},null,{"$f":"'Simple Scoring Approach'!F23","v":"Transport[4]"},null,{"$f":"'Simple Scoring Approach'!D21","v":"Construction process[3]"},null,{"$f":"'Simple Scoring Approach'!F27","v":"Building operation[1]"},null,{"$f":"'Simple Scoring Approach'!F33","v":"Construction process[3]"},null,{"$f":"'Simple Scoring Approach'!F35","v":"Transport[4]"},null,{"$f":"'Simple Scoring Approach'!F29","v":"Embodied[5]"},null,null,{"$f":"'Simple Scoring Approach'!F37","v":"Direct GHG emissions - Refrigerants[5]"},null,{"$f":"'Simple Scoring Approach'!F40","v":"Nitrogen Oxides (NOx)[6]"},null,{"$f":"'Simple Scoring Approach'!F43","v":"Building operation[7]"},null,{"$f":"'Simple Scoring Approach'!F45","v":"Construction process[8]"},null,{"$f":"'Simple Scoring Approach'!F48","v":"Construction waste generated[9]"},null,{"$f":"'Simple Scoring Approach'!F50","v":"Construction waste diverted from landfill[10]"},null,{"$f":"'Simple Scoring Approach'!F52","v":"Demolition waste diverted from landfill[11]"},null,{"$f":"'Simple Scoring Approach'!F54","v":"Demolition waste to disposal[11]"},null,{"$f":"'Simple Scoring Approach'!F56","v":"Material for re-use[12]"},null,{"$f":"'Simple Scoring Approach'!F58","v":"Material for recycling[12]"},null,{"$f":"'Simple Scoring Approach'!F60","v":"Material for energy recovery[12]"},null,{"$f":"'Simple Scoring Approach'!F62","v":"Hazardous waste to disposal[12]"},null,{"$f":"'Simple Scoring Approach'!F65","v":"Materials responsibly sourced[11]"},{"$f":"'Simple Scoring Approach'!F67","v":"Predicted percentage dissatisfied (PPD)[12]"},{"$f":"'Simple Scoring Approach'!F72","v":"Formaldehyde concentration level[13]"},{"$f":"'Simple Scoring Approach'!F74","v":"Total volatile organic compound concentration[13]"}]
[{"$f":"'Assessment Details'!H7","v":"BRE Assessment reference no."},{"$f":"'Assessment Details'!H9","v":"Client name"},{"$f":"'Assessment Details'!H11","v":"Building end user/occupier"},{"$f":"'Assessment Details'!H13","v":"Assessor name"},{"$f":"'Assessment Details'!H15","v":"Assessor organisation"},{"$f":"'Assessment Details'!H22","v":"Building name"},{"$f":"'Assessment Details'!H24","v":"Building address"},null,null,null,{"$f":"'Assessment Details'!H32","v":"N/A in International Tool"},{"$f":"'Assessment Details'!H34","v":"Post code"},{"$f":"'Assessment Details'!H38","v":"Building type (main description)"},{"$f":"'Assessment Details'!H40","v":"Building type (sub-group)"},{"$f":"'Assessment Details'!H42","v":"Building  floor area (GIA) m2"},{"$f":"'Assessment Details'!H44","v":"Building  floor area (NIA) m2"},{"$f":"'Assessment Details'!H46","v":"BREEAM scheme"},{"$f":"'Assessment Details'!H48","v":"BREEAM version"},{"$f":"'Assessment Details'!H50","v":"BREEAM International New Construction Technical Manual issue number"},{"$f":"'Assessment Details'!H52","v":"Project type"},{"$f":"'Assessment Details'!H54","v":"Assessment stage"},{"$f":"'Assessment Details'!H56","v":"Location type"},{"$f":"'Assessment Details'!H58","v":"Climatic zone"},{"$f":"'Assessment Details'!H60","v":"Building services - heating system type"},{"$f":"'Assessment Details'!H62","v":"Building services - cooling system type"},{"$f":"'Assessment Details'!H64","v":"Building services - domestic hot water system type"},{"$f":"'Assessment Details'!H66","v":"Building service - controls"},{"$f":"'Assessment Details'!H68","v":"If applicable, does this industrial building have a heated or cooled operational area?"},{"$f":"'Assessment Details'!H78","v":"Commercial/industrial refrigeration and cold storage systems"},{"$f":"'Assessment Details'!H84","v":"Internal or external planting and/or soft landscaping"},{"$f":"'Assessment Details'!H90","v":"Building user transportation systems (lifts and/or escalators)"},{"$f":"'Assessment Details'!H92","v":"Laboratory function/area and size category"},{"$f":"'Assessment Details'!H94","v":"Laboratory containment level"},{"$f":"'Assessment Details'!H96","v":"Fume cupboard(s) and/or other containment devices"},{"$f":"'Assessment Details'!H88","v":"Vehicle Wash System"},{"$f":"'Assessment Details'!H98","v":"If applicable, will this healthcare building house inpatients? "},{"$f":"'Assessment Details'!#REF!","v":{"$error":"#REF!"}},{"$f":"'Assessment Details'!H100","v":"If applicable, does this building contain areas requiring SAP assessment?"},{"$f":"'Assessment Details'!H102","v":"If SAP used, what proportion of the building's total floor area (GIA) does it apply to?"},{"$f":"'Assessment Details'!H107","v":"Developer"},{"$f":"'Assessment Details'!H109","v":"Principal contractor"},{"$f":"'Assessment Details'!H111","v":"Architect"},{"$f":"'Assessment Details'!H113","v":"Project management"},{"$f":"'Assessment Details'!H115","v":"Building services"},{"$f":"'Assessment Details'!H117","v":"BREEAM Accredited Professional"},{"$f":"'Assessment Details'!H119","v":"Other project team member 1"},{"$f":"'Assessment Details'!H121","v":"Other project team member 2"},{"$f":"'Assessment Details'!H123","v":"Other project team member 3"},{"$f":"'Assessment Details'!H125","v":"Other project team member 4"},{"$f":"'Simple Scoring Approach'!D8","v":"Indicative BREEAM rating"},{"$f":"'Simple Scoring Approach'!D10","v":"Indicative total score"},{"$f":"'Simple Scoring Approach'!#REF!","v":{"$error":"#REF!"}},{"$f":"'Simple Scoring Approach'!#REF!","v":{"$error":"#REF!"}},{"$f":"'Simple Scoring Approach'!#REF!","v":{"$error":"#REF!"}},{"$f":"'Simple Scoring Approach'!#REF!","v":{"$error":"#REF!"}},{"$f":"'Simple Scoring Approach'!#REF!","v":{"$error":"#REF!"}},{"$f":"'Simple Scoring Approach'!#REF!","v":{"$error":"#REF!"}},{"$f":"'Simple Scoring Approach'!#REF!","v":{"$error":"#REF!"}},{"$f":"'Simple Scoring Approach'!#REF!","v":{"$error":"#REF!"}},{"$f":"'Simple Scoring Approach'!#REF!","v":{"$error":"#REF!"}},{"$f":"'Simple Scoring Approach'!#REF!","v":{"$error":"#REF!"}},{"$f":"'Simple Scoring Approach'!L15","v":"Intensity"},{"$f":"'Simple Scoring Approach'!P15","v":"Total"},{"$f":"$BJ$4","v":"Intensity"},{"$f":"$BK$4","v":"Total"},{"$f":"$BJ$4","v":"Intensity"},{"$f":"$BK$4","v":"Total"},{"$f":"$BJ$4","v":"Intensity"},{"$f":"$BK$4","v":"Total"},{"$f":"$BJ$4","v":"Intensity"},{"$f":"$BK$4","v":"Total"},{"$f":"$BJ$4","v":"Intensity"},{"$f":"$BK$4","v":"Total"},{"$f":"$BJ$4","v":"Intensity"},{"$f":"$BK$4","v":"Total"},{"$f":"$BJ$4","v":"Intensity"},{"$f":"$BK$4","v":"Total"},{"$f":"'Simple Scoring Approach'!P31","v":"Proportion of applicable main building elements that data reported covers"},{"$f":"$BJ$4","v":"Intensity"},{"$f":"$BK$4","v":"Total"},{"$f":"$BJ$4","v":"Intensity"},{"$f":"$BK$4","v":"Total"},{"$f":"$BJ$4","v":"Intensity"},{"$f":"$BK$4","v":"Total"},{"$f":"$BJ$4","v":"Intensity"},{"$f":"$BK$4","v":"Total"},{"$f":"$BJ$4","v":"Intensity"},{"$f":"$BK$4","v":"Total"},{"$f":"$BJ$4","v":"Intensity"},{"$f":"$BK$4","v":"Total"},{"$f":"$BJ$4","v":"Intensity"},{"$f":"$BK$4","v":"Total"},{"$f":"$BJ$4","v":"Intensity"},{"$f":"$BK$4","v":"Total"},{"$f":"$BJ$4","v":"Intensity"},{"$f":"$BK$4","v":"Total"},{"$f":"$BJ$4","v":"Intensity"},{"$f":"$BK$4","v":"Total"},{"$f":"$BJ$4","v":"Intensity"},{"$f":"$BK$4","v":"Total"},{"$f":"$BJ$4","v":"Intensity"},{"$f":"$BK$4","v":"Total"},{"$f":"$BK$4","v":"Total"},{"$f":"$BJ$4","v":"Intensity"},{"$f":"$BJ$4","v":"Intensity"},{"$f":"$BJ$4","v":"Intensity"}]
["No./Text","Text","Text","Text","Text","Text","Text","Text","Text","Text","Text","Text","Text","Text","No.","No.","Text","Text","No.","Text","Text","Text","Text","Text","Text","Text","Text","Text","Text","Text","Text","Text","Text","Text","Text","Text","Text","Text","%","Text","Text","Text","Text","Text","Text","Text","Text","Text","Text","Text","%","%","%","%","%","%","%","%","%","%","%",{"$f":"'Simple Scoring Approach'!N17","v":"kWh/m2/yr"},{"$f":"'Simple Scoring Approach'!R17","v":"kWh/yr"},{"$f":"'Simple Scoring Approach'!N19","v":"kWh/m2/yr"},{"$f":"'Simple Scoring Approach'!R19","v":"kWh/yr"},{"$f":"'Simple Scoring Approach'!N23","v":"INA"},{"$f":"'Simple Scoring Approach'!R23","v":"INA"},{"$f":"'Simple Scoring Approach'!N21","v":"INA"},{"$f":"'Simple Scoring Approach'!R21","v":"INA"},{"$f":"'Simple Scoring Approach'!N27","v":"kgCO2eq/m2/yr"},{"$f":"'Simple Scoring Approach'!R27","v":"kgCO2eq/yr"},{"$f":"'Simple Scoring Approach'!N33","v":"INA"},{"$f":"'Simple Scoring Approach'!R33","v":"INA"},{"$f":"'Simple Scoring Approach'!N35","v":"INA"},{"$f":"'Simple Scoring Approach'!R35","v":"INA"},{"$f":"'Simple Scoring Approach'!N29","v":"kgCO2eq/m2"},{"$f":"'Simple Scoring Approach'!R29","v":"kgCO2eq"},"%",{"$f":"'Simple Scoring Approach'!N37","v":"KgCO2eq/kWcoolth"},{"$f":"'Simple Scoring Approach'!R37","v":"KgCO2eq"},{"$f":"'Simple Scoring Approach'!N40","v":"mg/kWh"},{"$f":"'Simple Scoring Approach'!R40","v":"kg/yr"},{"$f":"'Simple Scoring Approach'!N43","v":"INA"},{"$f":"'Simple Scoring Approach'!R43","v":"INA"},{"$f":"'Simple Scoring Approach'!N45","v":"INA"},{"$f":"'Simple Scoring Approach'!R45","v":"INA"},{"$f":"'Simple Scoring Approach'!N48","v":"m3/100m2"},{"$f":"'Simple Scoring Approach'!R48","v":"tonnes"},{"$f":"'Simple Scoring Approach'!N50","v":"m3/100m2"},{"$f":"'Simple Scoring Approach'!R50","v":"tonnes"},{"$f":"'Simple Scoring Approach'!N52","v":"%"},{"$f":"'Simple Scoring Approach'!R52","v":"INA"},{"$f":"'Simple Scoring Approach'!N54","v":"%"},{"$f":"'Simple Scoring Approach'!R54","v":"INA"},{"$f":"'Simple Scoring Approach'!N56","v":"tonnes/100m2"},{"$f":"'Simple Scoring Approach'!R56","v":"tonnes"},{"$f":"'Simple Scoring Approach'!N58","v":"tonnes/100m2"},{"$f":"'Simple Scoring Approach'!R58","v":"tonnes"},{"$f":"'Simple Scoring Approach'!N60","v":"tonnes/100m2"},{"$f":"'Simple Scoring Approach'!R60","v":"tonnes"},{"$f":"'Simple Scoring Approach'!N62","v":"tonnes/100m2"},{"$f":"'Simple Scoring Approach'!R62","v":"tonnes"},{"$f":"'Simple Scoring Approach'!N65","v":"%"},{"$f":"'Simple Scoring Approach'!N67","v":"%"},{"$f":"'Simple Scoring Approach'!N72","v":"INA"},{"$f":"'Simple Scoring Approach'!N74","v":"INA"}]
[{"$f":"AD_ref","v":0},{"$f":"AD_client","v":0},{"$f":"AD_Builduser","v":0},{"$f":"AD_assessor","v":0},{"$f":"AD_Assessor_org","v":0},{"$f":"ADBN","v":0},{"$f":"AD_Add01","v":0},{"$f":"AD_Add02","v":0},{"$f":"AD_Add03","v":0},{"$f":"AD_Add04","v":0},{"$f":"AD_County","v":0},{"$f":"AD_PC","v":0},{"$f":"ADBT0","v":0},{"$f":"ADBT_sub01","v":0},{"$f":"AD_GIA","v":0},{"$f":"AD_NIFA","v":0},{"$f":"AD_scheme","v":"New Construction"},{"$f":"AD_version","v":"2013 (SD5075)"},{"$f":"AD_SchIss","v":0},{"$f":"ADPT","v":0},{"$f":"ADAS0","v":"Pre-assessment"},{"$f":"AD_Location","v":0},{"$f":"AD_climate","v":0},{"$f":"AD_heat","v":0},{"$f":"AD_cool","v":0},{"$f":"AD_DHWS","v":0},{"$f":"AD_controls","v":0},{"$f":"ADIND_option02","v":0},{"$f":"AD_refrig","v":0},{"$f":"AD_Landscape","v":0},{"$f":"AD_Trans","v":0},{"$f":"AD_Labsize","v":0},{"$f":"AD_catlevel","v":0},{"$f":"ADFume_option01","v":0},{"$f":"AD_Vehiclewash","v":0},{"$f":"ADHC_option01","v":0},{"$f":"ADIND_option01","v":{"$error":"#REF!"}},{"$f":"AD_MultiRes_option01","v":"Option not applicable to building type"},{"$f":"AD_MultiRes_option02","v":"Option not applicable to building type"},{"$f":"AD_Developer","v":0},{"$f":"AD_Contractor","v":0},{"$f":"AD_Architect","v":0},{"$f":"AD_Projman","v":0},{"$f":"AD_Buildserve","v":0},{"$f":"AD_BREEAMAP","v":0},{"$f":"AD_Other01","v":0},{"$f":"AD_Other02","v":0},{"$f":"AD_other03","v":0},{"$f":"AD_Other04","v":0},{"$f":"BP_BREEAMRating","v":""},{"$f":"BP_OverallScore","v":""},{"$f":"BP_Man_score","v":0},{"$f":"BP_HW_score","v":{"$error":"#VALUE!"}},{"$f":"BP_Energy_score","v":0},{"$f":"BP_Trans_score","v":0},{"$f":"BP_Water_score","v":0},{"$f":"BP_Materials_score","v":0},{"$f":"BP_Waste_Score","v":0},{"$f":"BP_LUE_score","v":0},{"$f":"BP_Pollution_score","v":{"$error":"#VALUE!"}},{"$f":"BP_Innovation_score","v":0},{"$f":"BP_KPI01","v":"INA"},{"$f":"BP_KPI02","v":"INA"},{"$f":"BP_KPI07","v":"INA"},{"$f":"BP_KPI08","v":"INA"},{"$f":"BP_KPI05","v":"INA"},{"$f":"BP_KPI06","v":"INA"},{"$f":"BP_KPI03","v":"INA"},{"$f":"BP_KPI04","v":"INA"},{"$f":"BP_KPI09","v":"INA"},{"$f":"BP_KPI10","v":"INA"},{"$f":"BP_KPI11","v":"INA"},{"$f":"BP_KPI12","v":"INA"},{"$f":"BP_KPI13","v":"INA"},{"$f":"BP_KPI14","v":"INA"},{"$f":"BP_KPI15","v":"INA"},{"$f":"BP_KPI16","v":"INA"},{"$f":"BP_KPI49","v":"INA"},{"$f":"BP_KPI17","v":"INA"},{"$f":"BP_KPI18","v":"INA"},{"$f":"BP_KPI21","v":"INA"},{"$f":"BP_KPI22","v":{"$error":"#VALUE!"}},{"$f":"BP_KPI23","v":"INA"},{"$f":"BP_KPI24","v":"INA"},{"$f":"BP_KPI25","v":"INA"},{"$f":"BP_KPI26","v":"INA"},{"$f":"BP_KPI27","v":1},{"$f":"BP_KPI28","v":"INA"},{"$f":"BP_KPI29","v":0},{"$f":"BP_KPI30","v":"INA"},{"$f":"BP_KPI31","v":"INA"},{"$f":"BP_KPI32","v":"INA"},{"$f":"BP_KPI33","v":"INA"},{"$f":"BP_KPI34","v":"INA"},{"$f":"BP_KPI37","v":"INA"},{"$f":"BP_KPI38","v":"INA"},{"$f":"BP_KPI39","v":"INA"},{"$f":"BP_KPI40","v":"INA"},{"$f":"BP_KPI41","v":"INA"},{"$f":"BP_KPI42","v":"INA"},{"$f":"BP_KPI35","v":"INA"},{"$f":"BP_KPI36","v":"INA"},{"$f":"BP_KPI43","v":"INA"},{"$f":"BP_KPI45","v":"INA"},{"$f":"BP_KPI47","v":"-"},{"$f":"BP_KPI48","v":"INA"}]
[]
[{"$f":"Man_01","v":"Man01 Sustainable Procurement"},null,null,null,null,null,null,null,null,null,null,null,{"$f":"Man_02","v":"Man02 Responsible Construction Practices"},null,null,null,null,{"$f":"Man_03","v":"Man03 Construction Site Impacts"},null,null,null,null,null,null,null,null,{"$f":"Man_04","v":"Man04 Stakeholder Participation"},null,null,null,null,null,{"$f":"Man_05","v":"Man05 Life cycle cost and service life planning"},null,null,null,null,{"$f":"Hea_01","v":"Hea01 Visual Comfort"},null,null,null,null,null,null,null,null,{"$f":"Hea_02","v":"Hea02 Indoor Air Quality"},null,null,null,null,null,null,null,{"$f":"Hea_03","v":"Hea03 Thermal Comfort"},null,null,null,{"$f":"Hea_04","v":"Hea04 Water Quality"},null,null,null,null,{"$f":"'Detailed Scoring Approach'!B270","v":"Hea05 Acoustic Performance"},null,null,null,{"$f":"Hea_06","v":"Hea06 Safe Access"},null,null,null,{"$f":"Ene_01","v":"Ene01 Energy Efficiency "},null,null,null,null,null,null,null,"Ene01 modelling data (SBEM or SAP): note where both SAP and SBEM are used on an assessed project this data relates to SBEM (non-dwellings) data only (the columns further on contain the SAP data)",null,null,null,null,null,null,null,null,null,null,null,"Ene01: note where both SAP and SBEM are used on an assessed project this data relates to SAP (non-dwellings) data.",null,null,null,null,null,null,null,null,null,null,null,null,{"$f":"Ene_02","v":"Ene02 Energy Monitoring"},null,null,null,{"$f":"Ene_03","v":"Ene03 External Lighting"},null,null,{"$f":"Ene_04","v":"Ene04 Low and Zero Carbon Technology"},null,null,null,null,null,null,null,null,null,null,null,{"$f":"Ene_05","v":"Ene05 Energy Efficient Cold Storage"},null,null,null,null,null,{"$f":"Ene_06","v":"Ene06 Energy Efficient Transportation Systems"},null,null,null,{"$f":"Ene_07","v":"Ene07 Energy Efficient Laboratory Systems"},null,null,null,null,null,null,null,null,null,null,null,null,null,null,{"$f":"Ene_08","v":"Ene08 Energy Efficient Equipment"},null,null,"Equipment present",null,null,null,null,null,null,null,"Equipment defined as significant majority contributor",null,null,null,null,null,null,null,{"$f":"Ene_09","v":"Ene09 Drying Space"},null,null,{"$f":"Tra_01","v":"Tra01 Public Transport Accessibility "},null,null,null,null,null,null,{"$f":"Tra_02","v":"Tra02 Proximity to Amenities"},null,null,{"$f":"Tra_03","v":"Tra03  Alternative modes of transport "},null,null,null,null,null,null,{"$f":"Tra_04","v":"Tra04 Maximum Car Parking Capacity"},null,null,{"$f":"Tra_05","v":"Tra05 Travel Plan"},null,null,{"$f":"Wat_01","v":"Wat01 Water Consumption"},null,null,null,null,null,null,null,null,null,null,null,{"$f":"Wat_02","v":"Wat02 Water Monitoring"},null,null,null,null,null,{"$f":"Wat_03","v":"Wat03 Water Leak Detection and Prevention"},null,null,null,{"$f":"Wat_04","v":"Wat04 Water Efficient Equipment"}]
[{"$f":"'Detailed Scoring Approach'!F37","v":"Total BREEAM credits achieved"},{"$f":"'Detailed Scoring Approach'!F39","v":"Total contribution to overall building score"},{"$f":"'Detailed Scoring Approach'!F41","v":"Total BREEAM innovation credits achieved"},{"$f":"'Detailed Scoring Approach'!H25","v":"Will roles, responsibilities and a training schedule be defined in accordance with BREEAM?"},{"$f":"'Detailed Scoring Approach'!H26","v":"Will a BREEAM AP be appointed before concept design stage & performance targets contractually agreed?"},{"$f":"'Detailed Scoring Approach'!H27","v":"Will a BREEAM AP be appointed to monitor and report progress during feasibility & design stage?"},{"$f":"'Detailed Scoring Approach'!H28","v":"BREEAM AP appointed to monitor & report progress during pre-construction to post-practical completion?"},{"$f":"'Detailed Scoring Approach'!H29","v":"Will a thermographic survey or air leakage test be conducted and any defects uncovered remedied?"},{"$f":"'Detailed Scoring Approach'!H30","v":"Will compliant commissioning of building services be carried out?"},{"$f":"'Detailed Scoring Approach'!H31","v":"Will national best practice commissioning codes be followed?"},{"$f":"'Detailed Scoring Approach'!H32","v":"Will compliant seasonal commissioning of building services be carried out?"},{"$f":"'Detailed Scoring Approach'!H35","v":"Exemplary level: Will occupant satisfaction, water/energy be recorded/reported for 3 yrs post construction?"},{"$f":"'Detailed Scoring Approach'!F58","v":"Total BREEAM credits achieved"},{"$f":"'Detailed Scoring Approach'!F62","v":0},{"$f":"'Detailed Scoring Approach'!F60","v":"Total contribution to overall building score"},{"$f":"'Detailed Scoring Approach'!H54","v":0},{"$f":"'Detailed Scoring Approach'!H56","v":"Which level of responsible construction practices will be achieved by the contractor?"},{"$f":"'Detailed Scoring Approach'!F105","v":"Total BREEAM credits achieved"},{"$f":"'Detailed Scoring Approach'!F107","v":"Total contribution to overall building score"},{"$f":"'Detailed Scoring Approach'!H76","v":"Will site energy consumption be metered/monitored?"},{"$f":"'Detailed Scoring Approach'!H77","v":"Will site water consumption be metered/monitored?"},{"$f":"'Detailed Scoring Approach'!H78","v":"Will the transport of construction materials and waste to/from site be measured/monitored?"},{"$f":"'Detailed Scoring Approach'!H79","v":"Will all site timber be from legally harvested and legally traded sources?"},{"$f":"'Detailed Scoring Approach'!H80","v":"Will/does the principal contractor operate a compliant Environmental Management System?"},{"$f":"'Detailed Scoring Approach'!H81","v":"Will the principal contractor adopt best practice pollution prevention policies & procedures?"},"Construction site management credit achieved",{"$f":"'Detailed Scoring Approach'!F134","v":"Total BREEAM credits achieved"},{"$f":"'Detailed Scoring Approach'!F136","v":"Total contribution to overall building score"},{"$f":"'Detailed Scoring Approach'!H122","v":"Will an appropriate level of consultation activities be undertaken?"},{"$f":"'Detailed Scoring Approach'!H123","v":"Will an access statement be developed and appropriate building user facilities provided?"},{"$f":"'Detailed Scoring Approach'!H124","v":"Will building user guides and relevant user information be provided?"},{"$f":"'Detailed Scoring Approach'!H125","v":"Will a post occupancy evaluation assessment be undertaken and information disseminated?"},{"$f":"'Detailed Scoring Approach'!F155","v":"Total BREEAM credits achieved"},{"$f":"'Detailed Scoring Approach'!F157","v":"Total contribution to overall building score"},{"$f":"'Detailed Scoring Approach'!H151","v":"Will a feasibility stage Life Cycle Cost (LCC) analysis be commissioned and completed?"},{"$f":"'Detailed Scoring Approach'!H152","v":"Will a strategic and system level LCC be commissioned and completed?"},{"$f":"'Detailed Scoring Approach'!H153","v":"Will a technical design LCC to be commissioned and completed?"},{"$f":"'Detailed Scoring Approach'!F181","v":"Total BREEAM credits achieved"},{"$f":"'Detailed Scoring Approach'!F183","v":"Total contribution to overall building score"},{"$f":"'Detailed Scoring Approach'!F185","v":"Total BREEAM innovation credits achieved"},{"$f":"'Detailed Scoring Approach'!H175","v":"Will all fluorescent lamps be fitted with high frequency ballasts?"},{"$f":"'Detailed Scoring Approach'!H176","v":"Will all relevant building areas be designed to achieve the appropriate daylight criteria?"},{"$f":"'Detailed Scoring Approach'!H177","v":"Will the design provide adequate glare control and view out for building users?"},{"$f":"'Detailed Scoring Approach'!H178","v":"Will internal/external lighting be specified in accordance with the relevant best practice standards?"},{"$f":"'Detailed Scoring Approach'!H179","v":0},{"$f":"'Detailed Scoring Approach'!#REF!","v":{"$error":"#REF!"}},{"$f":"'Detailed Scoring Approach'!F215","v":"Total BREEAM credits achieved"},{"$f":"'Detailed Scoring Approach'!F217","v":"Total contribution to overall building score"},{"$f":"'Detailed Scoring Approach'!H199","v":"Will an air quality plan be produced?"},{"$f":"'Detailed Scoring Approach'!H201","v":"Will the relevant products be specified to meet the VOC testing and emission levels required?"},{"$f":"'Detailed Scoring Approach'!H202","v":"Will formaldehyde and total VOC levels be measured post construction?"},{"$f":"'Detailed Scoring Approach'!H203","v":"Will the building be designed to, or have the potential to provide, natural ventilation?"},{"$f":"'Detailed Scoring Approach'!H204","v":"Fume cupboards (manufacture and installation)"},{"$f":"'Detailed Scoring Approach'!H206","v":"Containment Level 2 and 3 labs (ventilation, pollution and safety) "},{"$f":"'Detailed Scoring Approach'!F239","v":"Total BREEAM credits achieved"},{"$f":"'Detailed Scoring Approach'!F241","v":"Total contribution to overall building score"},{"$f":"'Detailed Scoring Approach'!H232","v":"Will thermal modelling of the design be carried out?"},{"$f":"'Detailed Scoring Approach'!H233","v":"Will the modelling inform the development of a thermal zoning and control strategy?"},{"$f":"'Detailed Scoring Approach'!F260","v":"Total BREEAM credits achieved"},{"$f":"'Detailed Scoring Approach'!F262","v":"Total contribution to overall building score"},{"$f":"'Detailed Scoring Approach'!H256","v":"Will water systems comply with relevant best practice standards for microbial contamination?"},{"$f":"'Detailed Scoring Approach'!H257","v":"Where humidification is to be provided, will a failsafe humidification system be specified?"},{"$f":"'Detailed Scoring Approach'!H258","v":"Will a wholesome supply of accessible, clean and fresh drinking water be supplied for building users?"},{"$f":"'Detailed Scoring Approach'!F288","v":"Total BREEAM credits achieved"},{"$f":"'Detailed Scoring Approach'!F290","v":"Total contribution to overall building score"},{"$f":"'Detailed Scoring Approach'!H279","v":"Will the building meet the relevant ambient noise & sound insulation requirements?"},{"$f":"'Detailed Scoring Approach'!H280","v":"Will the building meet the relevant reverberation times?"},{"$f":"'Detailed Scoring Approach'!F307","v":"Total BREEAM credits achieved"},{"$f":"'Detailed Scoring Approach'!F309","v":"Total contribution to overall building score"},{"$f":"'Detailed Scoring Approach'!H305","v":"Where external site areas are present, will safe access be designed for pedestrians and cyclists?"},{"$f":"'Detailed Scoring Approach'!#REF!","v":{"$error":"#REF!"}},{"$f":"'Detailed Scoring Approach'!F416","v":"Total BREEAM credits achieved"},{"$f":"'Detailed Scoring Approach'!F418","v":"Total contribution to overall building score"},{"$f":"'Detailed Scoring Approach'!F420","v":"Total BREEAM innovation credits achieved"},"Regulated energy consumption met via carbon neutral sources",{"$f":"'Detailed Scoring Approach'!N413","v":"Is the building designed to be 'carbon negative' ?"},{"$f":"'Detailed Scoring Approach'!N414","v":"If the building is defined as 'carbon negative' what is the total (modelled) renewable/carbon neutral energy generated and exported"},"Energy modelling outputs used","Area weighted percentage improvement on Target Emission Rate",{"$f":"'Detailed Scoring Approach'!F394","v":"Notional building energy demand"},{"$f":"'Detailed Scoring Approach'!F395","v":"Actual building energy demand"},{"$f":"'Detailed Scoring Approach'!F396","v":"Notional building primary energy consumption"},{"$f":"'Detailed Scoring Approach'!F397","v":"Actual building primary energy consumption"},{"$f":"'Detailed Scoring Approach'!F398","v":"Notional Building Emission Rate"},{"$f":"'Detailed Scoring Approach'!F399","v":"Actual Building Emission Rate"},{"$f":"'Detailed Scoring Approach'!F400","v":"Actual Bdg Emission Rate improvement over Notional Building"},{"$f":"'Detailed Scoring Approach'!F401","v":"Demand Energy Performance Ratio (EPR)"},{"$f":"'Detailed Scoring Approach'!F402","v":"Consumption Energy Performance Ratio (EPR)"},{"$f":"'Detailed Scoring Approach'!F403","v":"CO2 Energy Performance Ratio (EPR)"},{"$f":"'Detailed Scoring Approach'!F404","v":"Overall Building Energy Performance Ratio (EPRNC)"},"Credits achieved for SBEM modelled outputs (Where SAP and SBEM used)",{"$f":"'Assessment Details'!H102","v":"If SAP used, what proportion of the building's total floor area (GIA) does it apply to?"},{"$f":"'Detailed Scoring Approach'!F394","v":"Notional building energy demand"},{"$f":"'Detailed Scoring Approach'!F395","v":"Actual building energy demand"},{"$f":"'Detailed Scoring Approach'!F396","v":"Notional building primary energy consumption"},{"$f":"'Detailed Scoring Approach'!F397","v":"Actual building primary energy consumption"},{"$f":"'Detailed Scoring Approach'!F398","v":"Notional Building Emission Rate"},{"$f":"'Detailed Scoring Approach'!F399","v":"Actual Building Emission Rate"},{"$f":"'Detailed Scoring Approach'!F400","v":"Actual Bdg Emission Rate improvement over Notional Building"},{"$f":"'Detailed Scoring Approach'!F401","v":"Demand Energy Performance Ratio (EPR)"},{"$f":"'Detailed Scoring Approach'!F402","v":"Consumption Energy Performance Ratio (EPR)"},{"$f":"'Detailed Scoring Approach'!F403","v":"CO2 Energy Performance Ratio (EPR)"},{"$f":"'Detailed Scoring Approach'!F404","v":"Overall Building Energy Performance Ratio (EPRNC)"},"Credits achieved for SAP modelled outputs (Where SAP and SBEM used)",{"$f":"'Detailed Scoring Approach'!F447","v":"Total BREEAM credits achieved"},{"$f":"'Detailed Scoring Approach'!F449","v":"Total contribution to overall building score"},{"$f":"'Detailed Scoring Approach'!H434","v":"Will a BMS or sub-meters be specified to monitor energy use from major building services systems?"},{"$f":"'Detailed Scoring Approach'!H435","v":"Will a BMS or sub-meters be specified to monitor energy use by tenant/building function areas?"},{"$f":"'Detailed Scoring Approach'!F466","v":"Total BREEAM credits achieved"},{"$f":"'Detailed Scoring Approach'!F468","v":"Total contribution to overall building score"},{"$f":"'Detailed Scoring Approach'!H464","v":"Will external light fittings and controls be specified in accordance with the BREEAM criteria?"},{"$f":"'Detailed Scoring Approach'!F487","v":"Total BREEAM credits achieved"},{"$f":"'Detailed Scoring Approach'!F489","v":"Total contribution to overall building score"},{"$f":"'Detailed Scoring Approach'!F491","v":"Total BREEAM innovation credits achieved"},"Feasibility study",{"$f":"'Detailed Scoring Approach'!#REF!","v":{"$error":"#REF!"}},"Feasibility study credits achieved","Percentage net reduction in CO2 emissions (for scoping period)","Credits achieved for percentage net reduction in CO2 emissions (for scoping period)",{"$f":"'Detailed Scoring Approach'!#REF!","v":{"$error":"#REF!"}},{"$f":"'Detailed Scoring Approach'!#REF!","v":{"$error":"#REF!"}},"Free Cooling stategy","Free Cooling strategy credits",{"$f":"'Detailed Scoring Approach'!F508","v":"Total BREEAM credits achieved"},{"$f":"'Detailed Scoring Approach'!F510","v":"Total contribution to overall building score"},{"$f":"'Detailed Scoring Approach'!F512","v":"Total BREEAM innovation credits achieved"},{"$f":"'Detailed Scoring Approach'!H504","v":"Will the refrigeration system be designed, installed & commissioned in accordance with BREEAM criteria?"},{"$f":"'Detailed Scoring Approach'!H505","v":"Will the components meet published energy efficiency criteria?"},{"$f":"'Detailed Scoring Approach'!H506","v":"Will the refrigeration system demonstrate a saving in indirect greenhouse gas emissions?"},{"$f":"'Detailed Scoring Approach'!F528","v":"Total BREEAM credits achieved"},{"$f":"'Detailed Scoring Approach'!F530","v":"Total contribution to overall building score"},{"$f":"'Detailed Scoring Approach'!H525","v":"Will an analysis be carried out to determine the optimum number and size of lifts/escalators?"},{"$f":"'Detailed Scoring Approach'!H526","v":"Will the appropriate energy efficient transportation design features be included?"},{"$f":"'Detailed Scoring Approach'!F561","v":"Total BREEAM credits achieved"},{"$f":"'Detailed Scoring Approach'!F563","v":"Total contribution to overall building score"},{"$f":"'Detailed Scoring Approach'!H546","v":"Fume cupboards and/or other containment device specification "},{"$f":"'Detailed Scoring Approach'!H548","v":"Best Practice Energy Practices in Laboratories (table 6-2)"},{"$f":"'Detailed Scoring Approach'!H549","v":"Item b) Fan power"},{"$f":"'Detailed Scoring Approach'!H550","v":"Item c) Fume cupboard volume flow rates"},{"$f":"'Detailed Scoring Approach'!H551","v":"Item d) Grouping / isolation of high filtration/ventilation activities "},{"$f":"'Detailed Scoring Approach'!H552","v":"Item e) Energy recovery - heat "},{"$f":"'Detailed Scoring Approach'!H553","v":"Item f) Energy recovery - cooling"},{"$f":"'Detailed Scoring Approach'!H554","v":"Item g) Grouping of cooling loads "},{"$f":"'Detailed Scoring Approach'!H555","v":"Item h) Free cooling"},{"$f":"'Detailed Scoring Approach'!H556","v":"Item i) Load responsiveness"},{"$f":"'Detailed Scoring Approach'!H557","v":"Item j) Cleanrooms"},{"$f":"'Detailed Scoring Approach'!H558","v":"Item k) Diversity"},{"$f":"'Detailed Scoring Approach'!H559","v":"Item l) Room air-change rates"},{"$f":"'Detailed Scoring Approach'!F590","v":"Total BREEAM credits achieved"},{"$f":"'Detailed Scoring Approach'!F592","v":"Total contribution to overall building score"},{"$f":"'Detailed Scoring Approach'!H588","v":"Will the significant majority contributor(s) to 'unregulated' energy use (above) meet the BREEAM criteria?"},{"$f":"'Detailed Scoring Approach'!H579","v":"Small power and plug in equipment"},{"$f":"'Detailed Scoring Approach'!H580","v":"Swimming pool"},{"$f":"'Detailed Scoring Approach'!H581","v":"Communal laundry"},{"$f":"'Detailed Scoring Approach'!H582","v":"Data centre"},{"$f":"'Detailed Scoring Approach'!H583","v":"IT-intensive operation areas"},{"$f":"'Detailed Scoring Approach'!H584","v":"Residential areas with domestic scale appliances"},{"$f":"'Detailed Scoring Approach'!#REF!","v":{"$error":"#REF!"}},{"$f":"'Detailed Scoring Approach'!H585","v":"Kitchen and catering facilities"},{"$f":"'Detailed Scoring Approach'!H579","v":"Small power and plug in equipment"},{"$f":"'Detailed Scoring Approach'!H580","v":"Swimming pool"},{"$f":"'Detailed Scoring Approach'!H581","v":"Communal laundry"},{"$f":"'Detailed Scoring Approach'!H582","v":"Data centre"},{"$f":"'Detailed Scoring Approach'!H583","v":"IT-intensive operation areas"},{"$f":"'Detailed Scoring Approach'!H584","v":"Residential areas with domestic scale appliances"},{"$f":"'Detailed Scoring Approach'!#REF!","v":{"$error":"#REF!"}},{"$f":"'Detailed Scoring Approach'!H585","v":"Kitchen and catering facilities"},{"$f":"'Detailed Scoring Approach'!F609","v":"Total BREEAM credits achieved"},{"$f":"'Detailed Scoring Approach'!F611","v":"Total contribution to overall building score"},{"$f":"'Detailed Scoring Approach'!H607","v":"Will internal/external drying space and fixings be provided?"},{"$f":"'Detailed Scoring Approach'!F645","v":"Total BREEAM credits achieved"},{"$f":"'Detailed Scoring Approach'!F647","v":"Total contribution to overall building score"},{"$f":"'Detailed Scoring Approach'!H628","v":"What is the building type category (for the purpose of Tra01 issue assessment)?"},{"$f":"'Detailed Scoring Approach'!H631","v":"Indicative public transport accessibility index:"},{"$f":"'Detailed Scoring Approach'!H631","v":"Indicative public transport accessibility index:"},{"$f":"'Detailed Scoring Approach'!H632","v":"Will the building have a dedicated bus service?"},{"$f":"'Detailed Scoring Approach'!H632","v":"Will the building have a dedicated bus service?"},{"$f":"'Detailed Scoring Approach'!F672","v":"Total BREEAM credits achieved"},{"$f":"'Detailed Scoring Approach'!F674","v":"Total contribution to overall building score"},{"$f":"'Detailed Scoring Approach'!H668","v":"Will the building be in close proximity of and accessible to applicable amenities?"},{"$f":"'Detailed Scoring Approach'!F699","v":"Total BREEAM credits achieved"},{"$f":"'Detailed Scoring Approach'!F701","v":"Total contribution to overall building score"},{"$f":"'Detailed Scoring Approach'!H688","v":"What is the building type category (for the purpose of Tra03 issue assessment)?"},{"$f":"'Detailed Scoring Approach'!#REF!","v":{"$error":"#REF!"}},{"$f":"'Detailed Scoring Approach'!#REF!","v":{"$error":"#REF!"}},{"$f":"'Detailed Scoring Approach'!H691","v":"Please Select"},{"$f":"'Detailed Scoring Approach'!#REF!","v":{"$error":"#REF!"}},{"$f":"'Detailed Scoring Approach'!F723","v":"Total BREEAM credits achieved"},{"$f":"'Detailed Scoring Approach'!F725","v":"Total contribution to overall building score"},{"$f":"'Detailed Scoring Approach'!#REF!","v":{"$error":"#REF!"}},{"$f":"'Detailed Scoring Approach'!F742","v":"Total BREEAM credits achieved"},{"$f":"'Detailed Scoring Approach'!F744","v":"Total contribution to overall building score"},{"$f":"'Detailed Scoring Approach'!H740","v":"Will a transport plan based on site specific travel survey/assessment be developed?"},{"$f":"'Detailed Scoring Approach'!F808","v":"Total BREEAM credits achieved"},{"$f":"'Detailed Scoring Approach'!F810","v":"Total contribution to overall building score"},{"$f":"'Detailed Scoring Approach'!F812","v":"Total BREEAM innovation credits achieved"},"Calculation procedure used",{"$f":"'Detailed Scoring Approach'!H793","v":"Water Consumption from building micro-components "},{"$f":"'Detailed Scoring Approach'!H794","v":"Water demand met via greywater/rainwater sources"},{"$f":"'Detailed Scoring Approach'!H795","v":"Total net water consumption"},{"$f":"'Detailed Scoring Approach'!H796","v":"Improvement on baseline performance"},{"$f":"'Detailed Scoring Approach'!H799","v":"Total net Water Consumption "},{"$f":"'Detailed Scoring Approach'!H800","v":"Default building occupancy"},{"$f":"'Detailed Scoring Approach'!H804","v":"What is the target for % reduction in potable water consumption for sanitary use in the building?"},{"$f":"'Detailed Scoring Approach'!H805","v":0},{"$f":"'Detailed Scoring Approach'!F830","v":"Total BREEAM credits achieved"},{"$f":"'Detailed Scoring Approach'!F832","v":"Total contribution to overall building score"},{"$f":"'Detailed Scoring Approach'!H825","v":"Will there be a water meter on the mains water supply to the building(s)?"},{"$f":"'Detailed Scoring Approach'!H826","v":"Will metering/monitoring equipment be specified on the water supply to any relevant plant/building areas?"},{"$f":"'Detailed Scoring Approach'!H827","v":"Will all specified water meters have a pulsed output?"},{"$f":"'Detailed Scoring Approach'!H828","v":"If the site/building has an existing BMS connection, will all pulsed meters be connected to the BMS?"},{"$f":"'Detailed Scoring Approach'!F850","v":"Total BREEAM credits achieved"},{"$f":"'Detailed Scoring Approach'!F852","v":"Total contribution to overall building score"},{"$f":"'Detailed Scoring Approach'!H847","v":"Will a mains water leak detection system be installed on the building's mains water supply?"},{"$f":"'Detailed Scoring Approach'!H848","v":"Will a flow control device be fitted to each sanitary area/facility?"},{"$f":"'Detailed Scoring Approach'!F869","v":"Total BREEAM credits achieved"},{"$f":"'Detailed Scoring Approach'!F871","v":"Total contribution to overall building score"},{"$f":"'Detailed Scoring Approach'!H867","v":"Will water efficient irrigation methods be installed (including vehicle wash systems where specified)?"}]
["No. (credits)","%","No. (credits)","No. (credits)","No. (credits)","No. (credits)","No. (credits)","No. (credits)","No. (credits)","No. (credits)","No. (credits)","No. (credits)","No. (credits)","No. (credits)","%","Text","Text","No. (credits)","%","No. (credits)","No. (credits)","No. (credits)","No. (credits)","Text (compliant)","Text (compliant)","No. (credits)","No. (credits)","%","No. (credits)","No. (credits)","No. (credits)","No. (credits)","No.","%","No. (credits)","No. (credits)","No. (credits)","No. (credits)","%","No. (credits)","Text (compliant)","No. (credits)","No. (credits)","No. (credits)","No. (credits)","No. (credits)","No. (credits)","%","No. (credits)","No. (credits)","No. (credits)","No. (credits)","No. (credits)","No. (credits)","No. (credits)","%","No. (credits)","No. (credits)","No. (credits)","%","Text (compliant)","Text (compliant)","Text (compliant)","No. (credits)","%","Text (compliant)","No. (credits)","No. (credits)","%","No. (credits)","No. (credits)","No. (credits)","%","No. (credits)","%","Text","kWh/yr","Text","%","MJ/m2/annum","MJ/m2/annum","kWh/m2/annum","kWh/m2/annum","kgCO2/m2/annum","kgCO2/m2/annum","%","Ratio","Ratio","Ratio","Ratio","No. (credits)","%","MJ/m2/annum","MJ/m2/annum","kWh/m2/annum","kWh/m2/annum","kgCO2/m2/annum","kgCO2/m2/annum","%","Ratio","Ratio","Ratio","Ratio","No. (credits)","No. (credits)","%","No. (credits)","No. (credits)","No. (credits)","%","No. (credits)","No. (credits)","%","No. (credits)","Text","Text","No. (credits)","%","No. (credits)",{"$f":"Ene04_23","v":{"$error":"#REF!"}},"Text","Text","No. (credits)","No. (credits)","%","No. (credits)","No. (credits)","No. (credits)","No. (credits)","No. (credits)","%","No. (credits)","No. (credits)","No. (credits)","%","No. (credits)","No. (credits)","Text (compliant)","Text (compliant)","Text (compliant)","Text (compliant)","Text (compliant)","Text (compliant)","Text (compliant)","Text (compliant)","Text (compliant)","Text (compliant)","Text (compliant)","No. (credits)","No. (credits)","No. (credits)","Text (equipment present)","Text (equipment present)","Text (equipment present)","Text (equipment present)","Text (equipment present)","Text (equipment present)","Text (equipment present)","Text (equipment present)","Text (equipment a significant contributor)","Text (equipment a significant contributor)","Text (equipment a significant contributor)","Text (equipment a significant contributor)","Text (equipment a significant contributor)","Text (equipment a significant contributor)","Text (equipment a significant contributor)","Text (equipment a significant contributor)","No. (credits)","%","Text (compliant)","No. (credits)","%","Text","No. (Accessibility Index)","No. (credits)","Text (compliant)","No. (credits)","No. (credits)","%","Text (compliant)","No. (credits)","%","Text (type)","No.","Text (type)","Text (compliant)","Text (compliant)","No. (credits)","%","No. (credits)","No. (credits)","%","No. (credits)","No. (credits)","%","No. (credits)","Text",{"$f":"IF(Wat01_01=AIS_option10,AIS_NA,'Detailed Scoring Approach'!L793)","v":"N/A"},{"$f":"IF(Wat01_01=AIS_option10,AIS_NA,'Detailed Scoring Approach'!L794)","v":"N/A"},{"$f":"IF(Wat01_01=AIS_option10,AIS_NA,'Detailed Scoring Approach'!L795)","v":"N/A"},{"$f":"IF(Wat01_01=AIS_option10,AIS_NA,'Detailed Scoring Approach'!L796)","v":"N/A"},{"$f":"IF(Wat01_01=AIS_option10,AIS_NA,'Detailed Scoring Approach'!L799)","v":"N/A"},{"$f":"IF(Wat01_01=AIS_option10,AIS_NA,\"No. (people)\")","v":"N/A"},"Text","%","No. (credits)","%","Text (compliant)","Text (compliant)","Text (compliant)","Text (compliant)","No. (credits)","%","No. (credits)","No. (credits)","No. (credits)","%","No. (credits)"]
[{"$f":"Man01_Tot","v":0},{"$f":"Man01_39","v":0},{"$f":"Man01_Exemp","v":0},{"$f":"Man01_19","v":0},{"$f":"Man01_20","v":0},{"$f":"Man01_21","v":0},{"$f":"Man01_22","v":0},{"$f":"Man01_23","v":0},{"$f":"Man01_24","v":0},{"$f":"Man01_25","v":0},{"$f":"Man01_26","v":0},{"$f":"Man01_27","v":0},{"$f":"Man02_Tot","v":0},{"$f":"Man02_Exemp","v":0},{"$f":"Man02_12","v":0},{"$f":"Man02_01","v":0},{"$f":"Man02_14","v":"Please select"},{"$f":"Man03_Tot","v":0},{"$f":"Man03_18","v":0},{"$f":"Man03_13","v":0},{"$f":"Man03_14","v":0},{"$f":"Man03_15","v":0},{"$f":"Man03_16","v":0},{"$f":"Man03_05","v":"No"},{"$f":"Man03_11","v":"No"},{"$f":"Man03_17","v":0},{"$f":"Man04_tot","v":0},{"$f":"'Detailed Scoring Approach'!H136","v":0},{"$f":"Man04_09","v":0},{"$f":"Man04_10","v":0},{"$f":"Man04_11","v":0},{"$f":"Man04_12","v":0},{"$f":"Man05_tot","v":0},{"$f":"'Detailed Scoring Approach'!H157","v":0},{"$f":"Man05_07","v":0},{"$f":"Man05_08","v":0},{"$f":"Man05_09","v":0},{"$f":"Hea01_tot","v":0},{"$f":"Hea01_27","v":0},{"$f":"Hea01_25","v":"N/A"},{"$f":"Hea01_01","v":"No"},{"$f":"Hea01_13","v":0},{"$f":"Hea01_14","v":0},{"$f":"Hea01_15","v":0},{"$f":"IF(Hea01_10=AIS_NA,AIS_NA,Hea01_16)","v":0},{"$f":"Hea01_17","v":{"$error":"#REF!"}},{"$f":"Hea02_tot","v":0},{"$f":"Hea02_26","v":0},{"$f":"Hea02_13","v":0},{"$f":"Hea02_14","v":0},{"$f":"Hea02_15","v":0},{"$f":"Hea02_16","v":0},{"$f":"Hea02_17","v":"N/A"},{"$f":"Hea02_18","v":"N/A"},{"$f":"Hea03_tot","v":0},{"$f":"'Detailed Scoring Approach'!H241","v":0},{"$f":"Hea03_05","v":0},{"$f":"Hea03_06","v":0},{"$f":"Hea04_tot","v":0},{"$f":"Hea04_13","v":0},{"$f":"Hea04_01","v":"No"},{"$f":"Hea04_02","v":"No"},{"$f":"Hea04_03","v":"No"},{"$f":"Hea05_tot","v":0},{"$f":"Hea05_08","v":0},{"$f":"Hea05_01","v":"No"},{"$f":"Hea05_06","v":0},{"$f":"Hea06_tot","v":0},{"$f":"Hea06_contr","v":0},{"$f":"Hea06_05","v":0},{"$f":"Hea06_06","v":{"$error":"#REF!"}},{"$f":"Ene01_tot","v":0},{"$f":"Ene01_42","v":0},{"$f":"Ene01_27","v":0},{"$f":"Ene01_36","v":0},{"$f":"Ene01_37","v":0},{"$f":"Ene01_40","v":0},{"$f":"Ene01_80","v":"SBEM only"},{"$f":"IF(BZ11=Ene01_80,Ene01_67,AIS_NA)","v":0},{"$f":"Ene01_02","v":0},{"$f":"Ene01_03","v":0},{"$f":"Ene01_04","v":0},{"$f":"Ene01_05","v":0},{"$f":"Ene01_06","v":0},{"$f":"Ene01_07","v":0},{"$f":"Ene01_08","v":""},{"$f":"Ene01_33","v":0},{"$f":"Ene01_34","v":0},{"$f":"Ene01_35","v":0},{"$f":"Ene01_09","v":0},{"$f":"IF(BZ11=Ene01_80,Ene01_89,AIS_NA)","v":0},{"$f":"IF(Ene01_80=AIS_statement90,AIS_NA,AD_MultiRes_option02)","v":"N/A"},{"$f":"IF(Ene01_80=AIS_statement90,AIS_NA,Ene01_44)","v":"N/A"},{"$f":"IF(Ene01_80=AIS_statement90,AIS_NA,Ene01_45)","v":"N/A"},{"$f":"IF(Ene01_80=AIS_statement90,AIS_NA,Ene01_46)","v":"N/A"},{"$f":"IF(Ene01_80=AIS_statement90,AIS_NA,Ene01_47)","v":"N/A"},{"$f":"IF(Ene01_80=AIS_statement90,AIS_NA,Ene01_48)","v":"N/A"},{"$f":"IF(Ene01_80=AIS_statement90,AIS_NA,Ene01_49)","v":"N/A"},{"$f":"IF(Ene01_80=AIS_statement90,AIS_NA,Ene01_50)","v":"N/A"},{"$f":"IF(Ene01_80=AIS_statement90,AIS_NA,Ene01_51)","v":"N/A"},{"$f":"IF(Ene01_80=AIS_statement90,AIS_NA,Ene01_52)","v":"N/A"},{"$f":"IF(Ene01_80=AIS_statement90,AIS_NA,Ene01_53)","v":"N/A"},{"$f":"IF(Ene01_80=AIS_statement90,AIS_NA,'Detailed Scoring Approach'!L404)","v":"N/A"},{"$f":"IF(BZ11=Ene01_80,Ene01_55,AIS_NA)","v":0},{"$f":"Ene02_tot","v":0},{"$f":"Ene02_13","v":0},{"$f":"Ene02_06","v":0},{"$f":"Ene02_07","v":0},{"$f":"Ene03_tot","v":0},{"$f":"Ene03_06","v":0},{"$f":"Ene03_03","v":0},{"$f":"Ene04_tot","v":0},{"$f":"Ene04_20","v":0},{"$f":"Ene04_15","v":"N/A"},{"$f":"IF(Ene04_01=AIS_option15,AIS_option15,IF(Ene04_01=AIS_option14,AIS_option14,IF(Ene04_01=AIS_option13,AIS_option13)))","v":{"$error":"#REF!"}},{"$f":"IF(OR(Ene04_01=AIS_option15,Ene04_01=AIS_option14),AIS_NA,Ene04_02)","v":{"$error":"#REF!"}},{"$f":"Ene04_11","v":{"$error":"#REF!"}},{"$f":"Ene04_05","v":{"$error":"#REF!"}},{"$f":"Ene04_12","v":{"$error":"#REF!"}},{"$f":"Ene04_KPI01","v":{"$error":"#REF!"}},{"$f":"Ene04_06","v":{"$error":"#REF!"}},{"$f":"Ene04_10","v":{"$error":"#REF!"}},{"$f":"Ene04_09","v":{"$error":"#REF!"}},{"$f":"Ene05_tot","v":0},{"$f":"Ene05_21","v":"N/A"},{"$f":"Ene05_14","v":"N/A"},{"$f":"Ene05_07","v":0},{"$f":"Ene05_08","v":0},{"$f":"Ene05_09","v":0},{"$f":"Ene06_tot","v":0},{"$f":"Ene06_12","v":0},{"$f":"Ene06_05","v":0},{"$f":"Ene06_06","v":0},{"$f":"Ene07_tot","v":"N/A"},{"$f":"Ene07_25","v":"N/A"},{"$f":"Ene07_05","v":0},{"$f":"Ene07_09","v":false},{"$f":"IF(ED11=AIS_NA,AIS_NA,Ene07_10)","v":"N/A"},{"$f":"IF(ED11=AIS_NA,AIS_NA,Ene07_11)","v":"N/A"},{"$f":"IF(ED11=AIS_NA,AIS_NA,Ene07_12)","v":"N/A"},{"$f":"IF(ED11=AIS_NA,AIS_NA,Ene07_13)","v":"N/A"},{"$f":"IF(ED11=AIS_NA,AIS_NA,Ene07_14)","v":"N/A"},{"$f":"IF(ED11=AIS_NA,AIS_NA,Ene07_15)","v":"N/A"},{"$f":"IF(ED11=AIS_NA,AIS_NA,Ene07_16)","v":"N/A"},{"$f":"IF(ED11=AIS_NA,AIS_NA,Ene07_17)","v":"N/A"},{"$f":"IF(ED11=AIS_NA,AIS_NA,Ene07_18)","v":"N/A"},{"$f":"IF(ED11=AIS_NA,AIS_NA,Ene07_19)","v":"N/A"},{"$f":"IF(ED11=AIS_NA,AIS_NA,Ene07_20)","v":"N/A"},{"$f":"Ene08_tot","v":0},{"$f":"Ene08_29","v":0},{"$f":"Ene08_19","v":0},{"$f":"Ene08_01","v":"No"},{"$f":"Ene08_02","v":"No"},{"$f":"Ene08_03","v":"No"},{"$f":"Ene08_04","v":"No"},{"$f":"Ene08_05","v":"No"},{"$f":"Ene08_06","v":"No"},{"$f":"Ene08_07","v":{"$error":"#REF!"}},{"$f":"Ene08_08","v":"No"},{"$f":"Ene08_09","v":"No"},{"$f":"Ene08_10","v":"No"},{"$f":"Ene08_11","v":"No"},{"$f":"Ene08_12","v":"No"},{"$f":"Ene08_13","v":"No"},{"$f":"Ene08_14","v":"No"},{"$f":"Ene08_15","v":{"$error":"#REF!"}},{"$f":"Ene08_16","v":"No"},{"$f":"Ene09_tot","v":"N/A"},{"$f":"Ene09_10","v":"N/A"},{"$f":"IF(FL11=AIS_NA,AIS_NA,Ene09_01)","v":"N/A"},{"$f":"Tra01_tot","v":0},{"$f":"TRa01_08","v":"See instruction"},{"$f":"AD_tra01type","v":0},{"$f":"Tra01_03","v":0},{"$f":"Tra01_05","v":0},{"$f":"IF(Tra01_03>0,AIS_NA,Tra01_04)","v":"No"},{"$f":"Tra01_06","v":0},{"$f":"Tra02_tot","v":0},{"$f":"Tra02_07","v":"See instruction"},{"$f":"Tra02_01","v":"No"},{"$f":"Tra03_tot","v":0},{"$f":"Tra03_14","v":"See instruction"},{"$f":"Tra03_02","v":{"$error":"#VALUE!"}},{"$f":"Tra03_03","v":{"$error":"#REF!"}},{"$f":"Tra03_04","v":{"$error":"#REF!"}},{"$f":"Tra03_05","v":0},{"$f":"Tra03_06","v":{"$error":"#REF!"}},{"$f":"Tra04_tot","v":0},{"$f":"Tra04_10","v":"N/A"},{"$f":"Tra04_04","v":{"$error":"#REF!"}},{"$f":"Tra05_tot","v":0},{"$f":"Tra05_05","v":"N/A"},{"$f":"Tra05_03","v":0},{"$f":"Wat01_tot","v":0},{"$f":"Wat01_15","v":0},{"$f":"Wat01_08","v":0},{"$f":"Wat01_01","v":"Alternative approach"},{"$f":"IF(Wat01_01=AIS_option10,AIS_NA,Wat01_02)","v":"N/A"},{"$f":"IF(Wat01_01=AIS_option10,AIS_NA,Wat01_03)","v":"N/A"},{"$f":"IF(Wat01_01=AIS_option10,AIS_NA,Wat01_04)","v":"N/A"},{"$f":"IF(Wat01_01=AIS_option10,AIS_NA,Wat01_05)","v":"N/A"},{"$f":"IF(Wat01_01=AIS_option10,AIS_NA,Wat01_KPI01)","v":"N/A"},{"$f":"IF(Wat01_01=AIS_option10,AIS_NA,Wat01_KPI02)","v":"N/A"},{"$f":"IF(Wat01_01=AIS_option10,Wat01_10,AIS_NA)","v":"Select percentage improvement:"},{"$f":"IF(Wat01_01=AIS_option10,Wat01_11,AIS_NA)","v":0},{"$f":"Wat02_tot","v":0},{"$f":"Wat02_13","v":0},{"$f":"Wat02_02","v":"No"},{"$f":"Wat02_03","v":"No"},{"$f":"Wat02_04","v":"No"},{"$f":"Wat02_05","v":"No"},{"$f":"Wat03_tot","v":0},{"$f":"Wat03_10","v":0},{"$f":"Wat03_05","v":0},{"$f":"Wat03_06","v":0},{"$f":"Wat04_tot","v":0},{"$f":"Wat04_06","v":0},{"$f":"Wat04_04","v":0}]
[]
[{"$f":"'Detailed Scoring Approach'!B882","v":"Mat01 Life Cycle Impacts"},null,null,null,null,null,null,null,{"$f":"'Detailed Scoring Approach'!H898","v":"External walls"},null,null,{"$f":"'Detailed Scoring Approach'!H899","v":"Windows"},null,null,{"$f":"'Detailed Scoring Approach'!H900","v":"Roof"},null,null,{"$f":"'Detailed Scoring Approach'!H901","v":"Upper floor construction"},null,null,{"$f":"'Detailed Scoring Approach'!H902","v":"Internal wall"},null,null,{"$f":"'Detailed Scoring Approach'!H903","v":"Floor finishes/coverings"},null,null,{"$f":"'Detailed Scoring Approach'!#REF!","v":{"$error":"#REF!"}},null,null,{"$f":"'Detailed Scoring Approach'!B919","v":"Mat03 Responsible Sourcing"},null,null,null,null,null,null,{"$f":"'Detailed Scoring Approach'!H939","v":"Structural Frame"},null,null,{"$f":"'Detailed Scoring Approach'!H940","v":"Ground floor"},null,null,{"$f":"'Detailed Scoring Approach'!H941","v":"Upper floors (including separating floors)"},null,null,{"$f":"'Detailed Scoring Approach'!H942","v":"Roof"},null,null,{"$f":"'Detailed Scoring Approach'!H943","v":"External walls"},null,null,{"$f":"'Detailed Scoring Approach'!H944","v":"Internal walls"},null,null,{"$f":"'Detailed Scoring Approach'!H945","v":"Foundation/substructure"},null,null,{"$f":"'Detailed Scoring Approach'!H946","v":"Fittings"},null,null,{"$f":"'Detailed Scoring Approach'!H947","v":"Hard landscaping"},null,null,{"$f":"Mat_04","v":"Mat04 Insulation"},null,null,null,null,null,{"$f":"Mat_05","v":"Mat05 Designing for Robustness"},null,null,{"$f":"Wst_01","v":"Wst01 Construction Waste Management"},null,null,null,null,null,null,null,null,null,null,null,null,null,null,null,{"$f":"Wst_02","v":"Wst02 Recycled Aggregates"},null,null,null,null,null,null,null,null,null,null,null,{"$f":"Wst_03","v":"Wst03 Operational Waste"},null,null,null,null,{"$f":"Wst_04","v":"Wst04 Speculative Floor and Ceiling Finishes"},null,null,{"$f":"LE_01","v":"LE01 Site Selection"},null,null,null,{"$f":"LE_02","v":"LE02 Ecological Value of Site and Protection of Ecological Features"},null,null,null,null,{"$f":"'Detailed Scoring Approach'!#REF!","v":{"$error":"#REF!"}},null,null,null,{"$f":"LE_04","v":"LE04 Enhancing Site Ecology"},null,null,null,null,{"$f":"LE_05","v":"LE05 Long Term Impact on Biodiversity"},null,null,null,null,null,null,null,{"$f":"Pol_01","v":"Pol01 Impact of Refrigerants"},null,null,null,null,null,null,null,{"$f":"Pol_02","v":"Pol02 NOx Emissions"},null,null,null,null,null,null,{"$f":"Pol_03","v":"Pol03 Surface Water Run off"},null,null,null,null,null,null,null,{"$f":"Pol_04","v":"Pol04 Reduction of Night Time Light Pollution"},null,null,{"$f":"Pol_05","v":"Pol05 Noise Attenuation"},null,null,null,{"$f":"Inn_01","v":"Inn01 Innovation"}]
[{"$f":"'Detailed Scoring Approach'!F909","v":"Total BREEAM credits achieved"},{"$f":"'Detailed Scoring Approach'!F911","v":"Total contribution to overall building score"},{"$f":"'Detailed Scoring Approach'!F913","v":"Total BREEAM innovation credits achieved"},{"$f":"'Detailed Scoring Approach'!H893","v":"Percentage of Mat01 points achieved"},{"$f":"'Detailed Scoring Approach'!#REF!","v":{"$error":"#REF!"}},{"$f":"'Detailed Scoring Approach'!H906","v":"Total embodied green house gas emissions for building (by assessed elements)"},{"$f":"'Detailed Scoring Approach'!H906","v":"Total embodied green house gas emissions for building (by assessed elements)"},{"$f":"'Detailed Scoring Approach'!H907","v":"Proportion of applicable building elements that data reported covers"},{"$f":"'Detailed Scoring Approach'!J896","v":"Total area of element m2"},{"$f":"'Detailed Scoring Approach'!L896","v":"Total impact\nkgCO2 eq."},{"$f":"'Detailed Scoring Approach'!N896","v":"Area of element impact data relevant to m2"},{"$f":"I14","v":"Total area of element m2"},{"$f":"J14","v":"Total impact\nkgCO2 eq."},"Area of element impact data relevant to m2","Total area of element m2","Total impact\nkgCO2 eq.","Area of element impact data relevant to m2","Total area of element m2",{"$f":"P14","v":"Total impact\nkgCO2 eq."},"Area of element impact data relevant to m2","Total area of element m2","Total impact\nkgCO2 eq.","Area of element impact data relevant to m2","Total area of element m2","Total impact\nkgCO2 eq.","Area of element impact data relevant to m2",{"$f":"'Detailed Scoring Approach'!#REF!","v":{"$error":"#REF!"}},{"$f":"'Detailed Scoring Approach'!#REF!","v":{"$error":"#REF!"}},{"$f":"'Detailed Scoring Approach'!#REF!","v":{"$error":"#REF!"}},{"$f":"'Detailed Scoring Approach'!F950","v":"Total BREEAM credits achieved"},{"$f":"'Detailed Scoring Approach'!F952","v":"Total contribution to overall building score"},{"$f":"'Detailed Scoring Approach'!F954","v":"Total BREEAM innovation credits achieved"},"Total responisble sourcing points achieved","Total responsible sourcing points available",{"$f":"'Detailed Scoring Approach'!H934","v":"Predicted percentage of available responsible sourcing points achieved:"},{"$f":"'Detailed Scoring Approach'!#REF!","v":{"$error":"#REF!"}},{"$f":"'Detailed Scoring Approach'!J937","v":"Element present / assessed"},{"$f":"'Detailed Scoring Approach'!L937","v":"% element responsibly sourced"},{"$f":"'Detailed Scoring Approach'!N937","v":"Responsible sourcing points"},{"$f":"AK14","v":"Element present / assessed"},"% element responsibly sourced","Responsible sourcing points","Element present / assessed","% element responsibly sourced","Responsible sourcing points","Element present / assessed","% element responsibly sourced","Responsible sourcing points","Element present / assessed","% element responsibly sourced","Responsible sourcing points","Element present / assessed","% element responsibly sourced","Responsible sourcing points","Element present / assessed","% element responsibly sourced","Responsible sourcing points","Element present / assessed","% element responsibly sourced","Responsible sourcing points","Element present / assessed","% element responsibly sourced","Responsible sourcing points",{"$f":"'Detailed Scoring Approach'!F969","v":"Total BREEAM credits achieved"},{"$f":"'Detailed Scoring Approach'!F971","v":"Total contribution to overall building score"},{"$f":"'Detailed Scoring Approach'!#REF!","v":{"$error":"#REF!"}},{"$f":"'Detailed Scoring Approach'!#REF!","v":{"$error":"#REF!"}},{"$f":"'Detailed Scoring Approach'!H967","v":"Will 80% of the building's insulating materials be responsibly sourced?"},{"$f":"'Detailed Scoring Approach'!H967","v":"Will 80% of the building's insulating materials be responsibly sourced?"},{"$f":"'Detailed Scoring Approach'!F988","v":"Total BREEAM credits achieved"},{"$f":"'Detailed Scoring Approach'!F990","v":"Total contribution to overall building score"},{"$f":"'Detailed Scoring Approach'!H986","v":"Will suitable durability/protection measures be specified and installed to vulnerable areas of the building?"},{"$f":"'Detailed Scoring Approach'!F1035","v":"Total BREEAM credits achieved"},{"$f":"'Detailed Scoring Approach'!F1037","v":"Total contribution to overall building score"},{"$f":"'Detailed Scoring Approach'!#REF!","v":{"$error":"#REF!"}},{"$f":"'Detailed Scoring Approach'!#REF!","v":{"$error":"#REF!"}},{"$f":"'Detailed Scoring Approach'!H1013","v":"Targets set for non-hazardous and hazardous waste produced on site"},{"$f":"'Detailed Scoring Approach'!H1014","v":"Procedures are in place to minimise non-hazardous and hazardous waste"},{"$f":"'Detailed Scoring Approach'!H1015","v":"Site construction waste is being monitored and targets regularly reviewed"},{"$f":"'Detailed Scoring Approach'!H1016","v":"Management has nominated individual responsible for implementing the above"},{"$f":"'Detailed Scoring Approach'!H1017","v":"Pre-demolition audit completed"},{"$f":"'Detailed Scoring Approach'!H1018","v":"Amount of waste generated will be reported via BREEAM Scoring & Reporting tool"},{"$f":"'Detailed Scoring Approach'!#REF!","v":{"$error":"#REF!"}},{"$f":"'Detailed Scoring Approach'!#REF!","v":{"$error":"#REF!"}},{"$f":"'Detailed Scoring Approach'!#REF!","v":{"$error":"#REF!"}},{"$f":"'Detailed Scoring Approach'!H1021","v":0},{"$f":"'Detailed Scoring Approach'!H1022","v":"Above criteria met"},{"$f":"'Detailed Scoring Approach'!#REF!","v":{"$error":"#REF!"}},{"$f":"'Detailed Scoring Approach'!F1056","v":"Total BREEAM credits achieved"},{"$f":"'Detailed Scoring Approach'!F1058","v":"Total contribution to overall building score"},{"$f":"'Detailed Scoring Approach'!F1060","v":"Total BREEAM innovation credits achieved"},{"$f":"'Detailed Scoring Approach'!H1052","v":"What is the target total % of high-grade aggregate that will be recycled/secondary aggregate?"},{"$f":"'Detailed Scoring Approach'!#REF!","v":{"$error":"#REF!"}},{"$f":"'Detailed Scoring Approach'!#REF!","v":{"$error":"#REF!"}},{"$f":"'Detailed Scoring Approach'!#REF!","v":{"$error":"#REF!"}},{"$f":"'Detailed Scoring Approach'!#REF!","v":{"$error":"#REF!"}},{"$f":"'Detailed Scoring Approach'!#REF!","v":{"$error":"#REF!"}},{"$f":"'Detailed Scoring Approach'!#REF!","v":{"$error":"#REF!"}},{"$f":"'Detailed Scoring Approach'!#REF!","v":{"$error":"#REF!"}},{"$f":"'Detailed Scoring Approach'!#REF!","v":{"$error":"#REF!"}},{"$f":"'Detailed Scoring Approach'!F1086","v":"Total BREEAM credits achieved"},{"$f":"'Detailed Scoring Approach'!F1088","v":"Total contribution to overall building score"},{"$f":"'Detailed Scoring Approach'!H1075","v":"Will appropriate facilities for the storage of operational recyclable waste volumes be provided?"},{"$f":"'Detailed Scoring Approach'!H1076","v":"If relevant, will a static waste compactor(s) or baler(s) be specified/installed?"},{"$f":"'Detailed Scoring Approach'!H1077","v":"If relevant, will a vessel for composting suitable organic waste be specified/installed?"},{"$f":"'Detailed Scoring Approach'!F1105","v":"Total BREEAM credits achieved"},{"$f":"'Detailed Scoring Approach'!F1107","v":"Total contribution to overall building score"},"Route to compliance",{"$f":"'Detailed Scoring Approach'!F1130","v":"Total BREEAM credits achieved"},{"$f":"'Detailed Scoring Approach'!F1132","v":"Total contribution to overall building score"},{"$f":"'Detailed Scoring Approach'!H1125","v":"What percentage of proposed development footprint will be on previously developed land?"},{"$f":"'Detailed Scoring Approach'!H1128","v":"Will remediation of the site be carried out?"},{"$f":"'Detailed Scoring Approach'!F1152","v":"Total BREEAM credits achieved"},{"$f":"'Detailed Scoring Approach'!F1154","v":"Total contribution to overall building score"},{"$f":"'Detailed Scoring Approach'!H1146","v":"How will the ecological value of the land be defined?"},{"$f":"'Detailed Scoring Approach'!H1149","v":"Can the land within the construction zone be defined as ‘land of low ecological value’?"},{"$f":"'Detailed Scoring Approach'!H1150","v":"Will all features of ecological value surrounding the construction zone/site boundary be protected?"},{"$f":"'Detailed Scoring Approach'!#REF!","v":{"$error":"#REF!"}},{"$f":"'Detailed Scoring Approach'!#REF!","v":{"$error":"#REF!"}},{"$f":"'Detailed Scoring Approach'!#REF!","v":{"$error":"#REF!"}},{"$f":"'Detailed Scoring Approach'!#REF!","v":{"$error":"#REF!"}},{"$f":"'Detailed Scoring Approach'!F1173","v":"Total BREEAM credits achieved"},{"$f":"'Detailed Scoring Approach'!F1175","v":"Total contribution to overall building score"},{"$f":"'Detailed Scoring Approach'!H1169","v":"Will a Suitably Qualified Ecologist be appointed to report on enhancing site ecology?"},{"$f":"'Detailed Scoring Approach'!H1170","v":"Will all recommendations in ecology report for protection of site ecology implemented?"},{"$f":"'Detailed Scoring Approach'!H1171","v":"What percentage of recommendtations for enhancement of site ecology will be implemented?"},{"$f":"'Detailed Scoring Approach'!F1198","v":"Total BREEAM credits achieved"},{"$f":"'Detailed Scoring Approach'!F1200","v":"Total contribution to overall building score"},{"$f":"'Detailed Scoring Approach'!H1190","v":"Will the project meet the pre-requisite criteria for this issue?"},{"$f":"'Detailed Scoring Approach'!H1191","v":"Will a Biodiversity Champion be appointed to monitor/minimise impacts of site activities on biodiversity?"},{"$f":"'Detailed Scoring Approach'!H1192","v":"Will the contractor provide training for the site workforce on how to protect ecology during the project?"},{"$f":"'Detailed Scoring Approach'!H1193","v":"Will the contractor record actions to protect biodiversity & monitor effectiveness during construction?"},{"$f":"'Detailed Scoring Approach'!H1194","v":"Will a new ecologically valuable habitat, appropriate to the local area, be created?"},{"$f":"'Detailed Scoring Approach'!H1195","v":"Will the contractor programme site works to minimise disturbance to wildlife?"},{"$f":"'Detailed Scoring Approach'!F1249","v":"Total BREEAM credits achieved"},{"$f":"'Detailed Scoring Approach'!F1251","v":"Total contribution to overall building score"},{"$f":"'Detailed Scoring Approach'!H1242","v":"Will refrigerant containing systems be installed in the building?"},"DELC based credits",{"$f":"'Detailed Scoring Approach'!H1244","v":"Will the specified refrigerant(s) have a Global Warming Potential of 10 or less?"},{"$f":"'Detailed Scoring Approach'!H1245","v":"What is the target range Direct Effect Life Cycle CO2eq. emissions for the system?"},{"$f":"'Detailed Scoring Approach'!H1246","v":"What will the Cooling/heating capacity of the system be?"},{"$f":"'Detailed Scoring Approach'!H1247","v":"Will a refrigerant leak detection and containment system be specified/installed?"},{"$f":"'Detailed Scoring Approach'!F1273","v":"Total BREEAM credits achieved"},{"$f":"'Detailed Scoring Approach'!F1275","v":"Total contribution to overall building score"},{"$f":"'Detailed Scoring Approach'!H1266","v":"Please enter the target/maximum dry NOx emission level for the space heating system:"},{"$f":"'Detailed Scoring Approach'!H1267","v":"Dry NOx emission level - cooling"},{"$f":"'Detailed Scoring Approach'!H1268","v":"Please enter the target/maximum dry NOx emission level for the water heating system:"},{"$f":"'Detailed Scoring Approach'!H1269","v":"Please select the Nominal Heat input for the heating plant:"},{"$f":"'Detailed Scoring Approach'!H1270","v":"Energy consumption: heating only or heating and cooling (as appropriate)"},{"$f":"'Detailed Scoring Approach'!F1296","v":"Total BREEAM credits achieved"},{"$f":"'Detailed Scoring Approach'!F1298","v":"Total contribution to overall building score"},{"$f":"'Detailed Scoring Approach'!H1290","v":"What is the actual/likely annual probability of flooding for the assessed site?"},{"$f":"'Detailed Scoring Approach'!H1291","v":"Will a Flood Risk Assessment be undertaken and ground level of the building/access meet BREEAM criteria?"},"Flood risk credits achieved",{"$f":"'Detailed Scoring Approach'!H1292","v":"Will the site meet the BREEAM criteria for peak rate surface water run off?"},{"$f":"'Detailed Scoring Approach'!H1293","v":"Will the site meet the criteria for surface water run off volume, attenuation and/or limiting discharge?"},{"$f":"'Detailed Scoring Approach'!H1294","v":"Will the site be designed to minimise watercourse pollution in accordance with the BREEAM criteria?"},{"$f":"'Detailed Scoring Approach'!F1315","v":"Total BREEAM credits achieved"},{"$f":"'Detailed Scoring Approach'!F1317","v":"Total contribution to overall building score"},{"$f":"'Detailed Scoring Approach'!H1313","v":"Will the external lighting be designed to reduce light pollution?"},{"$f":"'Detailed Scoring Approach'!F1335","v":"Total BREEAM credits achieved"},{"$f":"'Detailed Scoring Approach'!F1337","v":"Total contribution to overall building score"},{"$f":"'Detailed Scoring Approach'!H1332","v":"Will there be, or are there noise-sensitive areas/buildings within 800m radius of the development?"},{"$f":"'Detailed Scoring Approach'!H1333","v":"Will a noise impact assessment be completed and, if applicable, noise attenuation measures specified?"},{"$f":"'Detailed Scoring Approach'!F1372","v":"Total BREEAM innovation credits achieved"},{"$f":"'Detailed Scoring Approach'!F1374","v":"Total contribution to overall building score"},{"$f":"'Detailed Scoring Approach'!L1370","v":"Number of 'approved' innovation credits achieved?"},{"$f":"'Detailed Scoring Approach'!H1359","v":"Man01 Sustainable Procurement"},{"$f":"'Detailed Scoring Approach'!H1360","v":"Man02 Responsible Construction Practices"},{"$f":"'Detailed Scoring Approach'!H1361","v":"Hea02 Indoor Air Quality"},{"$f":"'Detailed Scoring Approach'!H1362","v":"Ene01 Energy Efficiency "},{"$f":"'Detailed Scoring Approach'!H1363","v":"Tra03  Alternative modes of transport "},{"$f":"'Detailed Scoring Approach'!#REF!","v":{"$error":"#REF!"}},{"$f":"'Detailed Scoring Approach'!H1364","v":"Wat01 Water Consumption"},{"$f":"'Detailed Scoring Approach'!H1365","v":"Mat01 Life Cycle Impacts"},{"$f":"'Detailed Scoring Approach'!H1366","v":"Mat03 Responsible Sourcing of Materials"},{"$f":"'Detailed Scoring Approach'!H1367","v":"Wst01 Construction Waste Management"},{"$f":"'Detailed Scoring Approach'!H1368","v":"Wst02 Recycled Aggregates"}]
["No. (credits)","%","No. (credits)","No.","No.",{"$f":"'Detailed Scoring Approach'!L906","v":"kgCO2 eq."},{"$f":"'Detailed Scoring Approach'!P906","v":"kgCO2 eq./m2"},"%","m2","kgCO2eq","m2","m2","kgCO2eq","m2","m2","kgCO2eq","m2","m2","kgCO2eq","m2","m2","kgCO2eq","m2","m2","kgCO2eq","m2","No. (credits)","%","No. (credits)","No. (credits)","%","No. (credits)","No.","No.","%","Text (compliant)","Text","%","No.","Text","%","No.","Text","%","No.","Text","%","No.","Text","%","No.","Text","%","No.","Text","%","No.","Text","%","No.","Text","%","No.","No. (credits)","%","No. (index)","No. (credits)","%","No. (credits)","No. (credits)","%","No. (credits)","No. (credits)","%","No. (credits)","Text (compliant)","Text (volume/percetnage)",{"$f":"'Detailed Scoring Approach'!L1014","v":0},{"$f":"'Detailed Scoring Approach'!L1015","v":0},{"$f":"'Detailed Scoring Approach'!L1016","v":0},{"$f":"'Detailed Scoring Approach'!L1017","v":0},{"$f":"'Detailed Scoring Approach'!L1018","v":0},{"$f":"'Detailed Scoring Approach'!#REF!","v":{"$error":"#REF!"}},{"$f":"'Detailed Scoring Approach'!#REF!","v":{"$error":"#REF!"}},{"$f":"'Detailed Scoring Approach'!#REF!","v":{"$error":"#REF!"}},{"$f":"'Detailed Scoring Approach'!L1021","v":0},{"$f":"'Detailed Scoring Approach'!L1022","v":0},{"$f":"'Detailed Scoring Approach'!#REF!","v":{"$error":"#REF!"}},"No. (credits)","%","No. (credits)","%","%","%","%","%","%","%","%","%","No. (credits)","%","Text (compliant)","Text (compliant)","Text (compliant)","No. (credits)","%","Text","No. (credits)","%","No. (credits)","No. (credits)","No. (credits)","%","Text","Text (compliant)","Text (compliant)","No. (credits)","%","Text",{"$f":"'Detailed Scoring Approach'!#REF!","v":{"$error":"#REF!"}},"No. (credits)","%","Text (compliant)","Text (compliant)",{"$f":"'Detailed Scoring Approach'!L1171","v":0},"No. (credits)","%","Text (compliant)","Text (compliant)","Text (compliant)","Text (compliant)","Text (compliant)","Text (compliant)","No. credits","%","Text","No.","Text",{"$f":"'Detailed Scoring Approach'!L1245","v":"kgCO2eq/kW coolth capacity"},{"$f":"'Detailed Scoring Approach'!L1246","v":"kW"},"No. (credits)","No. (credits)","%",{"$f":"'Detailed Scoring Approach'!L1266","v":"mg/kWh"},{"$f":"'Detailed Scoring Approach'!L1267","v":"mg/kWh"},{"$f":"'Detailed Scoring Approach'!L1268","v":"mg/kWh"},"Text (confirmation)",{"$f":"'Detailed Scoring Approach'!L1270","v":"kWh/m2/yr"},"No. (credits)","%","Text (risk level)","Text (compliant)","No. (credits)","No. (credits)","No. (credits)","No. (credits)","No. (credits)","%","No. (credits)","No. (credits)","%","Text","Text (compliant)","No. (credits)","%","No. (credits)","No. (credits)","No. (credits)","No. (credits)","No. (credits)","No. (credits)","No. (credits)","No. (credits)","No. (credits)","No. (credits)","No. (credits)","No. (credits)"]
[{"$f":"Mat01_tot","v":0},{"$f":"Mat01_28","v":0},{"$f":"Mat01_08","v":0},{"$f":"Mat01_05","v":0},{"$f":"Mat01_04","v":{"$error":"#REF!"}},{"$f":"Mat01_KPI01","v":"Missing data"},{"$f":"Mat01_KPI02","v":""},{"$f":"Mat01_KPI03","v":""},{"$f":"Mat01_09","v":0},{"$f":"Mat01_15","v":0},{"$f":"Mat01_21","v":0},{"$f":"Mat01_10","v":0},{"$f":"Mat01_16","v":0},{"$f":"Mat01_22","v":0},{"$f":"Mat01_11","v":0},{"$f":"Mat01_17","v":0},{"$f":"Mat01_23","v":0},{"$f":"Mat01_12","v":0},{"$f":"Mat01_18","v":0},{"$f":"Mat01_24","v":0},{"$f":"Mat01_13","v":0},{"$f":"Mat01_19","v":0},{"$f":"Mat01_25","v":0},{"$f":"Mat01_14","v":0},{"$f":"Mat01_20","v":0},{"$f":"Mat01_26","v":0},{"$f":"Mat02_tot","v":{"$error":"#REF!"}},{"$f":"Mat02_06","v":{"$error":"#REF!"}},{"$f":"Mat02_04","v":{"$error":"#REF!"}},{"$f":"Mat03_tot","v":0},{"$f":"Mat03_38","v":0},{"$f":"Mat03_35","v":0},{"$f":"SUM(Mat03_totalpoints)","v":0},{"$f":"4*(COUNTIF(Mat03_elementapp,AIS_Yes))","v":0},{"$f":"Mat03_03","v":"No"},{"$f":"Mat03_06","v":{"$error":"#REF!"}},{"$f":"Mat03_07","v":"No"},{"$f":"Mat03_16","v":0},{"$f":"Mat03_25","v":0},{"$f":"Mat03_08","v":"No"},{"$f":"Mat03_17","v":0},{"$f":"Mat03_26","v":0},{"$f":"Mat03_09","v":"No"},{"$f":"Mat03_18","v":0},{"$f":"Mat03_27","v":0},{"$f":"Mat03_10","v":"No"},{"$f":"Mat03_19","v":0},{"$f":"Mat03_28","v":0},{"$f":"Mat03_11","v":"No"},{"$f":"Mat03_20","v":0},{"$f":"Mat03_29","v":0},{"$f":"Mat03_12","v":"No"},{"$f":"Mat03_21","v":0},{"$f":"Mat03_30","v":0},{"$f":"Mat03_13","v":"No"},{"$f":"Mat03_22","v":0},{"$f":"Mat03_31","v":0},{"$f":"Mat03_14","v":"No"},{"$f":"Mat03_23","v":0},{"$f":"Mat03_32","v":0},{"$f":"Mat03_15","v":"No"},{"$f":"Mat03_24","v":0},{"$f":"Mat03_33","v":0},{"$f":"Mat04_tot","v":0},{"$f":"Mat04_10","v":0},{"$f":"Mat04_01","v":{"$error":"#REF!"}},{"$f":"Mat04_05","v":{"$error":"#REF!"}},{"$f":"Mat04_02","v":"No"},{"$f":"Mat04_06","v":0},{"$f":"Mat05_tot","v":0},{"$f":"Mat05_06","v":0},{"$f":"Mat05_03","v":0},{"$f":"Wst01_tot","v":0},{"$f":"Wst01_28","v":0},{"$f":"Wst01_01","v":0},{"$f":"Wst01_15","v":{"$error":"#REF!"}},{"$f":"Wst01_04","v":"No"},{"$f":"Wst01_02","v":"No"},{"$f":"Wst01_03","v":"No"},{"$f":"Wst01_05","v":"No"},{"$f":"Wst01_06","v":"No"},{"$f":"Wst01_29","v":"No"},{"$f":"Wst01_07","v":{"$error":"#REF!"}},{"$f":"Wst01_08","v":{"$error":"#REF!"}},{"$f":"Wst01_09","v":{"$error":"#REF!"}},{"$f":"Wst01_10","v":0},{"$f":"Wst01_11","v":"No"},{"$f":"Wst01_12","v":{"$error":"#REF!"}},{"$f":"Wst02_tot","v":0},{"$f":"Wst02_15","v":0},{"$f":"Wst02_11","v":0},{"$f":"Wst02_01","v":"Please select"},{"$f":"Wst02_02","v":{"$error":"#REF!"}},{"$f":"Wst02_03","v":{"$error":"#REF!"}},{"$f":"Wst02_04","v":{"$error":"#REF!"}},{"$f":"Wst02_05","v":{"$error":"#REF!"}},{"$f":"Wst02_06","v":{"$error":"#REF!"}},{"$f":"Wst02_07","v":{"$error":"#REF!"}},{"$f":"Wst02_08","v":{"$error":"#REF!"}},{"$f":"Wst02_09","v":{"$error":"#REF!"}},{"$f":"Wst03_tot","v":0},{"$f":"Wst03_13","v":0},{"$f":"Wst03_02","v":"No"},{"$f":"Wst03_03","v":"No"},{"$f":"Wst03_04","v":"No"},{"$f":"Wst04_tot","v":"N/A"},{"$f":"Wst04_09","v":"N/A"},{"$f":"Wst04_03","v":"Please select"},{"$f":"LE01_tot","v":0},{"$f":"LE01_08","v":0},{"$f":"LE01_05","v":0},{"$f":"LE01_06","v":0},{"$f":"LE02_tot","v":0},{"$f":"LE02_08","v":0},{"$f":"LE02_02","v":"The BREEAM checklist"},{"$f":"LE02_03","v":"No"},{"$f":"LE02_04","v":"No"},{"$f":"LE03_tot","v":{"$error":"#REF!"}},{"$f":"LE03_10","v":{"$error":"#REF!"}},{"$f":"LE03_02","v":{"$error":"#REF!"}},{"$f":"LE03_03","v":{"$error":"#REF!"}},{"$f":"LE04_tot","v":0},{"$f":"LE04_14","v":0},{"$f":"LE04_02","v":"No"},{"$f":"LE04_03","v":"No"},{"$f":"LE04_04","v":"Please select"},{"$f":"LE05_tot","v":0},{"$f":"LE05_15","v":0},{"$f":"LE05_02","v":"No"},{"$f":"LE05_03","v":"No"},{"$f":"LE05_04","v":"No"},{"$f":"LE05_05","v":"No"},{"$f":"LE05_06","v":"No"},{"$f":"LE05_07","v":"No"},{"$f":"Pol01_tot","v":0},{"$f":"Pol01_20","v":0},{"$f":"Pol01_02","v":"Yes"},{"$f":"Pol01_04","v":0},{"$f":"Pol01_06","v":"No"},{"$f":"Pol01_07","v":0},{"$f":"Pol01_21","v":0},{"$f":"Pol01_10","v":0},{"$f":"Pol02_tot","v":0},{"$f":"Pol02_27","v":0},{"$f":"Pol02_20","v":0},{"$f":"Pol02_29","v":"anything"},{"$f":"Pol02_21","v":0},{"$f":"Pol02_30","v":0},{"$f":"Pol01_KPI02","v":"anything"},{"$f":"Pol03_tot","v":0},{"$f":"Pol03_15","v":0},{"$f":"Pol03_01","v":"Please select"},{"$f":"Pol03_02","v":"No"},{"$f":"Pol03_10","v":0},{"$f":"Pol03_11","v":0},{"$f":"Pol03_12","v":0},{"$f":"Pol03_13","v":0},{"$f":"Pol04_tot","v":0},{"$f":"Pol04_06","v":0},{"$f":"Pol04_03","v":0},{"$f":"Pol05_tot","v":0},{"$f":"Pol05_11","v":0},{"$f":"Pol05_02","v":"Yes"},{"$f":"IF(Pol05_02=AIS_No,AIS_NA,Pol05_03)","v":"No"},{"$f":"Inn01_tot","v":0},{"$f":"Inn01_04","v":0},{"$f":"Inn01_01","v":0},{"$f":"'Detailed Scoring Approach'!N1359","v":0},{"$f":"'Detailed Scoring Approach'!N1360","v":0},{"$f":"'Detailed Scoring Approach'!N1361","v":0},{"$f":"'Detailed Scoring Approach'!N1362","v":0},{"$f":"'Detailed Scoring Approach'!N1363","v":0},{"$f":"'Detailed Scoring Approach'!#REF!","v":{"$error":"#REF!"}},{"$f":"'Detailed Scoring Approach'!N1364","v":0},{"$f":"'Detailed Scoring Approach'!N1365","v":0},{"$f":"'Detailed Scoring Approach'!N1366","v":0},{"$f":"'Detailed Scoring Approach'!N1367","v":0},{"$f":"'Detailed Scoring Approach'!N1368","v":0}]

{"sheet":"Assessment References","index":4,"n_rows":266,"n_cols":24,"rows_kept":266,"cut":false,"hidden":true,"merged":[[207,1,207,15],[206,3,206,15],[197,3,197,15],[198,3,198,15],[199,3,199,15],[200,3,200,15],[201,3,201,15],[202,3,202,15],[203,3,203,15],[204,3,204,15],[205,3,205,15],[196,3,196,15],[185,3,185,15],[186,3,186,15],[187,3,187,15],[188,3,188,15],[189,3,189,15],[192,3,192,15],[191,3,191,15],[190,3,190,15],[193,3,193,15],[194,3,194,15],[195,3,195,15],[184,3,184,15],[175,3,175,15],[176,3,176,15],[177,3,177,15],[178,3,178,15],[179,3,179,15],[180,3,180,15],[181,3,181,15],[182,3,182,15],[183,3,183,15],[174,3,174,15],[165,3,165,15],[166,3,166,15],[167,3,167,15],[168,3,168,15],[169,3,169,15],[170,3,170,15],[171,3,171,15],[172,3,172,15],[173,3,173,15],[164,3,164,15],[155,3,155,15],[156,3,156,15],[157,3,157,15],[158,3,158,15],[159,3,159,15],[160,3,160,15],[161,3,161,15],[162,3,162,15],[163,3,163,15],[154,3,154,15],[145,3,145,15],[146,3,146,15],[147,3,147,15],[148,3,148,15],[149,3,149,15],[150,3,150,15],[141,3,141,15],[142,3,142,15],[143,3,143,15],[132,3,132,15],[133,3,133,15],[134,3,134,15],[151,3,151,15],[152,3,152,15],[153,3,153,15],[144,3,144,15],[135,3,135,15],[136,3,136,15],[137,3,137,15],[138,3,138,15],[139,3,139,15],[140,3,140,15],[116,3,116,15],[117,3,117,15],[118,3,118,15],[125,3,125,15],[126,3,126,15],[127,3,127,15],[128,3,128,15],[129,3,129,15],[110,3,110,15],[111,3,111,15],[106,3,106,15],[107,3,107,15],[87,3,87,15],[88,3,88,15],[89,3,89,15],[90,3,90,15],[56,3,56,15],[57,3,57,15],[131,3,131,15],[104,3,104,15],[101,3,101,15],[102,3,102,15],[109,3,109,15],[124,3,124,15],[108,3,108,15],[122,3,122,15],[123,3,123,15],[119,3,119,15],[130,3,130,15],[120,3,120,15],[121,3,121,15],[112,3,112,15],[114,3,114,15],[115,3,115,15],[105,3,105,15],[58,3,58,15],[59,3,59,15],[60,3,60,15],[69,3,69,15],[61,3,61,15],[62,3,62,15],[63,3,63,15],[64,3,64,15],[65,3,65,15],[73,3,73,15],[100,3,100,15],[92,3,92,15],[93,3,93,15],[94,3,94,15],[95,3,95,15],[96,3,96,15],[97,3,97,15],[80,3,80,15],[81,3,81,15],[70,3,70,15],[71,3,71,15],[72,3,72,15],[76,3,76,15],[6,3,6,15],[7,3,7,15],[8,3,8,15],[9,3,9,15],[10,3,10,15],[11,3,11,15],[13,3,13,15],[14,3,14,15],[15,3,15,15],[12,3,12,15],[16,3,16,15],[32,3,32,15],[20,3,20,15],[17,3,17,15],[18,3,18,15],[19,3,19,15],[21,3,21,15],[28,3,28,15],[29,3,29,15],[22,3,22,15],[23,3,23,15],[24,3,24,15],[91,3,91,15],[82,3,82,15],[83,3,83,15],[84,3,84,15],[25,3,25,15],[26,3,26,15],[27,3,27,15],[74,3,74,15],[75,3,75,15],[66,3,66,15],[67,3,67,15],[68,3,68,15],[37,3,37,15],[38,3,38,15],[39,3,39,15],[41,3,41,15],[42,3,42,15],[54,3,54,15],[45,3,45,15],[46,3,46,15],[99,3,99,15],[98,3,98,15],[85,3,85,15],[86,3,86,15],[47,3,47,15],[48,3,48,15],[40,3,40,15],[30,3,30,15],[31,3,31,15],[33,3,33,15],[34,3,34,15],[55,3,55,15],[49,3,49,15],[50,3,50,15],[51,3,51,15],[52,3,52,15],[43,3,43,15],[44,3,44,15],[35,3,35,15],[36,3,36,15],[77,3,77,15],[78,3,78,15],[79,3,79,15],[53,3,53,15]]}
[]
[null,{"$f":"IF(OR(projecttype='Assessment Details'!Z214,projecttype=\"\"),\"BREEAM International 2013 New Construction Assessment Report: Assessment Validation References\",\"BREEAM International Bespoke 2013 New Construction Assessment Report: Assessment Validation References\")","v":"BREEAM International 2013 New Construction Assessment Report: Assessment Validation References"}]
[null,{"$f":"IF(AD_Mandatory_fields_text=AIS_statement09,\"Warning: All Mandatory fields in the assessment details worksheet must be completed/defined before the assessment can begin.\",\"\")","v":"Warning: All Mandatory fields in the assessment details worksheet must be completed/defined before the assessment can begin."}]
[null,null,null,null,"Building name:",null,{"$f":"IF(ADBN=\"\",\"\",ADBN)","v":""}]
[]
[null,"Identifier",null,"Assessment Evidence Reference",null,null,null,null,null,null,null,null,null,null,null,null,null,"Assessment issue",null,"Issue criteria No. and/or compliance note",null,"Assessor's supporting notes/information"]
[null,1,null,"e.g. Project A, First floor plan, rev05, 1/10/10. Supplied by F Fitzgerald (23/3/11)",null,null,null,null,null,null,null,null,null,null,null,null,null,"Wat02",null,1,null,"e.g. Plan indicates location of water meter in plant room located in south-west corner of the building."]
[null,2,null,"e.g. See identifier 1",null,null,null,null,null,null,null,null,null,null,null,null,null,"Mat05",null,"e.g. 1 and 2c",null,"e.g. Plan indicates vehicle parking within 1m of north façade and the provision of barriers to protect  façade."]
[null,3]
[null,4]
[null,5]
[null,6]
[null,7]
[null,8]
[null,9]
[null,10]
[null,11]
[null,12]
[null,13]
[null,14]
[null,15]
[null,16]
[null,17]
[null,18]
[null,19]
[null,20]
[null,21]
[null,22]
[null,23]
[null,24]
[null,25]
[null,26]
[null,27]
[null,28]
[null,29]
[null,30]
[null,31]
[null,32]
[null,33]
[null,34]
[null,35]
[null,36]
[null,37]
[null,38]
[null,39]
[null,40]
[null,41]
[null,42]
[null,43]
[null,44]
[null,45]
[null,46]
[null,47]
[null,48]
[null,49]
[null,50]
[null,51]
[null,52]
[null,53]
[null,54]
[null,55]
[null,56]
[null,57]
[null,58]
[null,59]
[null,60]
[null,61]
[null,62]
[null,63]
[null,64]
[null,65]
[null,66]
[null,67]
[null,68]
[null,69]
[null,70]
[null,71]
[null,72]
[null,73]
[null,74]
[null,75]
[null,76]
[null,77]
[null,78]
[null,79]
[null,80]
[null,81]
[null,82]
[null,83]
[null,84]
[null,85]
[null,86]
[null,87]
[null,88]
[null,89]
[null,90]
[null,91]
[null,92]
[null,93]
[null,94]
[null,95]
[null,96]
[null,97]
[null,98]
[null,99]
[null,100]
[null,101]
[null,102]
[null,103]
[null,104]
[null,105]
[null,106]
[null,107]
[null,108]
[null,109]
[null,110]
[null,111]
[null,112]
[null,113]
[null,114]
[null,115]
[null,116]
[null,117]
[null,118]
[null,119]
[null,120]
[null,121]
[null,122]
[null,123]
[null,124]
[null,125]
[null,126]
[null,127]
[null,128]
[null,129]
[null,130]
[null,131]
[null,132]
[null,133]
[null,134]
[null,135]
[null,136]
[null,137]
[null,138]
[null,139]
[null,140]
[null,141]
[null,142]
[null,143]
[null,144]
[null,145]
[null,146]
[null,147]
[null,148]
[null,149]
[null,150]
[null,151]
[null,152]
[null,153]
[null,154]
[null,155]
[null,156]
[null,157]
[null,158]
[null,159]
[null,160]
[null,161]
[null,162]
[null,163]
[null,164]
[null,165]
[null,166]
[null,167]
[null,168]
[null,169]
[null,170]
[null,171]
[null,172]
[null,173]
[null,174]
[null,175]
[null,176]
[null,177]
[null,178]
[null,179]
[null,180]
[null,181]
[null,182]
[null,183]
[null,184]
[null,185]
[null,186]
[null,187]
[null,188]
[null,189]
[null,190]
[null,191]
[null,192]
[null,193]
[null,194]
[null,195]
[null,196]
[null,197]
[null,198]
[null,199]
[null,200]
[null,null,null,"Insert further rows if required."]
[]
[]
[]
[null,null,null,null,null,null,null,null,null,null,null,null,null,null,null,null,null,null,null,null,null,null,null,"Man01"]
[null,null,null,null,null,null,null,null,null,null,null,null,null,null,null,null,null,null,null,null,null,null,null,"Man02"]
[null,null,null,null,null,null,null,null,null,null,null,null,null,null,null,null,null,null,null,null,null,null,null,"Man03"]
[null,null,null,null,null,null,null,null,null,null,null,null,null,null,null,null,null,null,null,null,null,null,null,"Man04a"]
[null,null,null,null,null,null,null,null,null,null,null,null,null,null,null,null,null,null,null,null,null,null,null,"Man04b"]
[null,null,null,null,null,null,null,null,null,null,null,null,null,null,null,null,null,null,null,null,null,null,null,"Man05"]
[null,null,null,null,null,null,null,null,null,null,null,null,null,null,null,null,null,null,null,null,null,null,null,"Hea01"]
[null,null,null,null,null,null,null,null,null,null,null,null,null,null,null,null,null,null,null,null,null,null,null,"Hea02"]
[null,null,null,null,null,null,null,null,null,null,null,null,null,null,null,null,null,null,null,null,null,null,null,"Hea03"]
[null,null,null,null,null,null,null,null,null,null,null,null,null,null,null,null,null,null,null,null,null,null,null,"Hea04"]
[null,null,null,null,null,null,null,null,null,null,null,null,null,null,null,null,null,null,null,null,null,null,null,"Hea05a"]
[null,null,null,null,null,null,null,null,null,null,null,null,null,null,null,null,null,null,null,null,null,null,null,"Hea05b"]
[null,null,null,null,null,null,null,null,null,null,null,null,null,null,null,null,null,null,null,null,null,null,null,"Hea06"]
[null,null,null,null,null,null,null,null,null,null,null,null,null,null,null,null,null,null,null,null,null,null,null,"Hea07"]
[null,null,null,null,null,null,null,null,null,null,null,null,null,null,null,null,null,null,null,null,null,null,null,"Hea08"]
[null,null,null,null,null,null,null,null,null,null,null,null,null,null,null,null,null,null,null,null,null,null,null,"Ene01"]
[null,null,null,null,null,null,null,null,null,null,null,null,null,null,null,null,null,null,null,null,null,null,null,"Ene02a"]
[null,null,null,null,null,null,null,null,null,null,null,null,null,null,null,null,null,null,null,null,null,null,null,"Ene02b"]
[null,null,null,null,null,null,null,null,null,null,null,null,null,null,null,null,null,null,null,null,null,null,null,"Ene03"]
[null,null,null,null,null,null,null,null,null,null,null,null,null,null,null,null,null,null,null,null,null,null,null,"Ene04"]
[null,null,null,null,null,null,null,null,null,null,null,null,null,null,null,null,null,null,null,null,null,null,null,"Ene05"]
[null,null,null,null,null,null,null,null,null,null,null,null,null,null,null,null,null,null,null,null,null,null,null,"Ene06"]
[null,null,null,null,null,null,null,null,null,null,null,null,null,null,null,null,null,null,null,null,null,null,null,"Ene07"]
[null,null,null,null,null,null,null,null,null,null,null,null,null,null,null,null,null,null,null,null,null,null,null,"Ene08"]
[null,null,null,null,null,null,null,null,null,null,null,null,null,null,null,null,null,null,null,null,null,null,null,"Ene09"]
[null,null,null,null,null,null,null,null,null,null,null,null,null,null,null,null,null,null,null,null,null,null,null,"Tra01"]
[null,null,null,null,null,null,null,null,null,null,null,null,null,null,null,null,null,null,null,null,null,null,null,"Tra02"]
[null,null,null,null,null,null,null,null,null,null,null,null,null,null,null,null,null,null,null,null,null,null,null,"Tra03a"]
[null,null,null,null,null,null,null,null,null,null,null,null,null,null,null,null,null,null,null,null,null,null,null,"Tra03b"]
[null,null,null,null,null,null,null,null,null,null,null,null,null,null,null,null,null,null,null,null,null,null,null,"Tra04"]
[null,null,null,null,null,null,null,null,null,null,null,null,null,null,null,null,null,null,null,null,null,null,null,"Tra05"]
[null,null,null,null,null,null,null,null,null,null,null,null,null,null,null,null,null,null,null,null,null,null,null,"Tra06"]
[null,null,null,null,null,null,null,null,null,null,null,null,null,null,null,null,null,null,null,null,null,null,null,"Wat01"]
[null,null,null,null,null,null,null,null,null,null,null,null,null,null,null,null,null,null,null,null,null,null,null,"Wat02"]
[null,null,null,null,null,null,null,null,null,null,null,null,null,null,null,null,null,null,null,null,null,null,null,"Wat03"]
[null,null,null,null,null,null,null,null,null,null,null,null,null,null,null,null,null,null,null,null,null,null,null,"Wat04"]
[null,null,null,null,null,null,null,null,null,null,null,null,null,null,null,null,null,null,null,null,null,null,null,"Mat01"]
[null,null,null,null,null,null,null,null,null,null,null,null,null,null,null,null,null,null,null,null,null,null,null,"Mat02"]
[null,null,null,null,null,null,null,null,null,null,null,null,null,null,null,null,null,null,null,null,null,null,null,"Mat03"]
[null,null,null,null,null,null,null,null,null,null,null,null,null,null,null,null,null,null,null,null,null,null,null,"Mat04"]
[null,null,null,null,null,null,null,null,null,null,null,null,null,null,null,null,null,null,null,null,null,null,null,"Mat05"]
[null,null,null,null,null,null,null,null,null,null,null,null,null,null,null,null,null,null,null,null,null,null,null,"Wst01"]
[null,null,null,null,null,null,null,null,null,null,null,null,null,null,null,null,null,null,null,null,null,null,null,"Wst02"]
[null,null,null,null,null,null,null,null,null,null,null,null,null,null,null,null,null,null,null,null,null,null,null,"Wst03a"]
[null,null,null,null,null,null,null,null,null,null,null,null,null,null,null,null,null,null,null,null,null,null,null,"Wst03b"]
[null,null,null,null,null,null,null,null,null,null,null,null,null,null,null,null,null,null,null,null,null,null,null,"Wst04"]
[null,null,null,null,null,null,null,null,null,null,null,null,null,null,null,null,null,null,null,null,null,null,null,"LE01"]
[null,null,null,null,null,null,null,null,null,null,null,null,null,null,null,null,null,null,null,null,null,null,null,"LE02"]
[null,null,null,null,null,null,null,null,null,null,null,null,null,null,null,null,null,null,null,null,null,null,null,"LE04"]
[null,null,null,null,null,null,null,null,null,null,null,null,null,null,null,null,null,null,null,null,null,null,null,"LE05"]
[null,null,null,null,null,null,null,null,null,null,null,null,null,null,null,null,null,null,null,null,null,null,null,"Pol01"]
[null,null,null,null,null,null,null,null,null,null,null,null,null,null,null,null,null,null,null,null,null,null,null,"Pol02"]
[null,null,null,null,null,null,null,null,null,null,null,null,null,null,null,null,null,null,null,null,null,null,null,"Pol03"]
[null,null,null,null,null,null,null,null,null,null,null,null,null,null,null,null,null,null,null,null,null,null,null,"Pol04"]
[null,null,null,null,null,null,null,null,null,null,null,null,null,null,null,null,null,null,null,null,null,null,null,"Pol05"]
[null,null,null,null,null,null,null,null,null,null,null,null,null,null,null,null,null,null,null,null,null,null,null,"Inn01"]

{"sheet":"Ene01 Calibrators - Domestic","index":5,"n_rows":191,"n_cols":28,"rows_kept":191,"cut":false,"hidden":true,"merged":[]}
[null,null,null,"m2","kgCO2/m2","kgCO2/m2","MJ/m2","MJ/m2","MJ/m2","MJ/m2",null,null,null,"CO2","Dem","Con"]
["#","File Name","Building Type","Area","TER","BER","Dn","Da","Cn","Ca",null,null,null,"% A/N","% A/N","% A/N"]
[1,"SH Baseline 1 bed ground elec.sap",null,null,28.9331,26.1952,153.39236861051114,110.32778977681787,130.11970000000002,50.667639999999999,null,null,null,{"$f":"(F3/E3)","v":0.90537135668144786},{"$f":"(H3/G3)","v":0.71925214256882986},{"$f":"(J3/I3)","v":0.38939253625700021}]
[2,"SH Baseline 1 bed top elec.sap",null,null,27.664000000000001,24.502199999999998,134.76817854571635,108.82886969042478,124.0659,47.393079999999998,null,null,null,{"$f":"(F4/E4)","v":0.88570705610179279},{"$f":"(H4/G4)","v":0.80752645665169109},{"$f":"(J4/I4)","v":0.38199924395019097}]
[3,"SH Baseline 1 bed ground gas.sap",null,null,17.639399999999998,13.05444,153.39236861051114,77.943196544276475,130.11970000000002,75.652940000000001,null,null,null,{"$f":"(F5/E5)","v":0.74007279159155082},{"$f":"(H5/G5)","v":0.50812955853225839},{"$f":"(J5/I5)","v":0.58141034754921805}]
[4,"SH Baseline 1 bed top gas.sap",null,null,16.920200000000001,13.023140000000001,134.76817854571635,77.335997120230388,124.0659,75.49494,null,null,null,0.76968002742284369,0.57384464162655657,0.60850676938626969]
[5,"SH Baseline 1 bed ground heat pump.sap",null,null,28.9331,21.810199999999998,153.39236861051114,206.01489560835137,130.11970000000002,42.186059999999998,null,null,null,0.75381483491226309,1.3430583116651496,0.32420963159306387]
[6,"SH Baseline 1 bed top heat pump.sap",null,null,27.664000000000001,20.945,134.76817854571635,195.08215982721379,124.0659,40.512460000000004,null,null,null,0.75712116830537879,1.4475387434359186,0.3265398469684257]
[7,"SH Baseline 2 bed ground elec.sap",null,null,26.777000000000001,25.994843750000001,162.01797606191505,108.8916261699064,120.85160937500001,50.280046874999996,null,null,null,0.97078999701236135,0.67209595389769305,0.4160478055280345]
[8,"SH Baseline 2 bed top elec.sap",null,null,25.4953,24.466249999999999,143.29159917206624,103.20278752699784,114.73739062500002,47.323468749999996,null,null,null,0.95963765870572215,0.72022915595401171,0.41245027878199569]
[9,"SH Baseline 2 bed ground gas.sap",null,null,16.344899999999999,16.032656249999999,162.01797606191505,88.64285232181426,120.85160937500001,69.265984375000002,null,null,null,0.98089656406585535,0.54711739077606714,0.57314904396572086]
[10,"SH Baseline 2 bed top gas.sap",null,null,15.618600000000001,15.408015625000001,143.29159917206624,80.919388948884091,114.73739062500002,66.706281250000004,null,null,null,0.98651707739490091,0.56471830460706307,0.58138224066833044]
[11,"SH Baseline 2 bed ground heat pump.sap",null,null,26.777000000000001,19.75,162.01797606191505,214.90786987041037,120.85160937500001,38.200984374999997,null,null,null,0.73757329051051268,1.3264446025932548,0.3160982677232137]
[12,"SH Baseline 2 bed top heat pump.sap",null,null,25.4953,19.192968749999999,143.29159917206624,192.78092940064795,114.73739062500002,37.123734374999998,null,null,null,0.75280419332190629,1.3453749592755562,0.32355393627812851]
[13,"SH Baseline 2 bed corner ground elec.sap",null,null,26.481400000000001,25.500428571428571,170.58778154890464,108.53003188316363,119.76848571428572,49.323971428571426,null,null,null,0.96295620969543039,0.63621222398070698,0.41182762839831222]
[14,"SH Baseline 2 bed corner top elec.sap",null,null,25.184899999999999,21.986857142857144,151.62089889951662,108.56597757893655,113.58391428571429,48.698642857142865,null,null,null,0.87301744866396713,0.71603570726015975,0.42874594667202631]
[15,"SH Baseline 2 bed corner ground gas.sap",null,null,16.512699999999999,15.991285714285716,179.97480201583872,99.328962254448214,122.81477142857142,69.301400000000001,null,null,null,0.96842343858277069,0.55190482857542889,0.56427577231868575]
[16,"SH Baseline 2 bed corner top gas.sap",null,null,15.4161,15.165714285714284,151.62089889951662,86.823614110871134,113.58391428571429,65.716500000000011,null,null,null,0.98375816748167721,0.57263619158735868,0.57857224249812045]
[17,"SH Baseline 2 bed corner ground heat pump.sap",null,null,26.481400000000001,19.51585714285714,170.58778154890464,211.78185745140391,119.76848571428572,37.748485714285714,null,null,null,0.73696470514614554,1.2414831562288042,0.31517878421153955]
[18,"SH Baseline 2 bed corner top heat pump.sap",null,null,25.184899999999999,19.021428571428572,151.62089889951662,196.9953460865988,113.58391428571429,36.792057142857146,null,null,null,0.75527115737718131,1.2992624863486206,0.32391960934106118]
[19,"SH Baseline bungalow elec.sap",null,null,36.552999999999997,33.422812499999999,308.20565604751619,195.90133414326854,167.48707812500001,71.396968749999999,null,null,null,0.91436578393018364,0.63561888076793227,0.42628344556058567]
[20,"SH Baseline bungalow gas.sap",null,null,21.885200000000001,20.357812500000001,308.20565604751619,195.37931965442766,167.48707812500001,92.213374999999999,null,null,null,0.93020911392173711,0.63392515945361483,0.55057008595719092]
[21,"SH Baseline bungalow heat pump.sap",null,null,36.552999999999997,24.08625,308.20565604751619,398.99095572354213,167.48707812500001,46.588531250000003,null,null,null,0.65894044264492657,1.2945607839916784,0.27816194402310701]
[]
["CO2",null,null,null,"Dem",null,null,null,"Con"]
[null,null,"points",null,null,null,"points",null,null,null,"points"]
["Mean",{"$f":"'Ene01 Calibrators - Domestic'!N27","v":0.85637583254621708},0.6,null,"Mean",{"$f":"'Ene01 Calibrators - Domestic'!O27","v":0.86461760189420733},0.8,null,"Mean",{"$f":"'Ene01 Calibrators - Domestic'!P27","v":0.43391787655382008},0.8,null,"Mean",{"$f":"AVERAGE(N3:N23)","v":0.85637583254621708},{"$f":"AVERAGE(O3:O23)","v":0.86461760189420733},{"$f":"AVERAGE(P3:P23)","v":0.43391787655382008}]
["Std Dev",{"$f":"'Ene01 Calibrators - Domestic'!N28","v":0.10917964972102889},{"$f":"LOG(1-C27)/LOG(B27)","v":5.9098014252417936},null,"Std Dev",{"$f":"'Ene01 Calibrators - Domestic'!O28","v":0.34471281660226682},{"$f":"LOG(1-G27)/LOG(F27)","v":11.063866155315511},null,"Std Dev",{"$f":"'Ene01 Calibrators - Domestic'!P28","v":0.11202890984813314},{"$f":"LOG(1-K27)/LOG(J27)","v":1.9277014455414054},null,"StanDev",{"$f":"STDEV(N3:N23)","v":0.10917964972102889},{"$f":"STDEV(O3:O23)","v":0.34471281660226682},{"$f":"STDEV(P3:P23)","v":0.11202890984813314}]
["x","CO2","Translator",null,"x","Dem","Translator",null,"x","Con","Translator",null,"x","CO2","Dem","Con"]
[{"$f":"M30","v":0},{"$f":"ROUND(NORMDIST($A30,B$27,B$28,FALSE),3)","v":0},{"$f":"1-$A30^C$28","v":1},null,{"$f":"M30","v":0},{"$f":"ROUND(NORMDIST($A30,F$27,F$28,FALSE),3)","v":0.05},{"$f":"1-$E30^G$28","v":1},null,{"$f":"M30","v":0},{"$f":"ROUND(NORMDIST($A30,J$27,J$28,FALSE),3)","v":2E-3},{"$f":"1-$I30^K$28","v":1},null,0,{"$f":"ROUND(NORMDIST($M30,N$27,N$28,FALSE),3)","v":0},0.05,2E-3]
[2.5000000000000001E-3,0,0.99999999999999956,null,2.5000000000000001E-3,5.0999999999999997E-2,1,null,2.5000000000000001E-3,2E-3,0.99999036159450749,null,2.5000000000000001E-3,0,5.0999999999999997E-2,2E-3]
[0.01,0,0.9999999999984851,null,0.01,5.3999999999999999E-2,1,null,0.01,3.0000000000000001E-3,0.99986049264366283,null,0.01,0,5.3999999999999999E-2,3.0000000000000001E-3]
[2.2499999999999999E-2,0,0.99999999981730536,null,2.2499999999999999E-2,5.8999999999999997E-2,1,null,2.2499999999999999E-2,4.0000000000000001E-3,0.99933396069620639,null,2.2499999999999999E-2,0,5.8999999999999997E-2,4.0000000000000001E-3]
[0.04,0,0.99999999452414245,null,0.04,6.6000000000000003E-2,0.99999999999999967,null,0.04,7.0000000000000001E-3,0.99798075496124039,null,0.04,0,6.6000000000000003E-2,7.0000000000000001E-3]
[6.25E-2,0,0.99999992345972644,null,6.25E-2,7.6999999999999999E-2,0.99999999999995237,null,6.25E-2,1.4999999999999999E-2,0.99522672815461155,null,6.25E-2,0,7.6999999999999999E-2,1.4999999999999999E-2]
[0.09,0,0.99999933963979781,null,0.09,9.2999999999999999E-2,0.99999999999730926,null,0.09,3.2000000000000001E-2,0.99035967281500337,null,0.09,0,9.2999999999999999E-2,3.2000000000000001E-2]
[0.1225,0,0.99999591619160688,null,0.1225,0.114,0.99999999991848088,null,0.1225,7.4999999999999997E-2,0.9825337923092371,null,0.1225,0,0.114,7.4999999999999997E-2]
[0.16,0,0.99998020720442515,null,0.16,0.14299999999999999,0.99999999843508769,null,0.16,0.17899999999999999,0.97077322204643479,null,0.16,0,0.14299999999999999,0.17899999999999999]
[0.20250000000000001,0,0.99992036396307293,null,0.20250000000000001,0.183,0.99999997879787761,null,0.20250000000000001,0.42199999999999999,0.95397492307774923,null,0.20250000000000001,0,0.183,0.42199999999999999]
[0.25,0,0.99972334087109949,null,0.25,0.23599999999999999,0.99999978178287052,null,0.25,0.92500000000000004,0.93091113081408561,null,0.25,0,0.23599999999999999,0.92500000000000004]
[0.30249999999999999,0,0.99914652637489831,null,0.30249999999999999,0.30599999999999999,0.99999820189480704,null,0.30249999999999999,1.79,0.90023147249982893,null,0.30249999999999999,0,0.30599999999999999,1.79]
[0.36,0,0.99761309086453154,null,0.36,0.39600000000000002,0.99998766922835602,null,0.36,2.8639999999999999,0.86046482887055142,null,0.36,0,0.39600000000000002,2.8639999999999999]
[0.42249999999999999,1E-3,0.9938523352393337,null,0.42249999999999999,0.50800000000000001,0.99992752356267101,null,0.42249999999999999,3.5430000000000001,0.81002099256916282,null,0.42249999999999999,1E-3,0.50800000000000001,3.5430000000000001]
[0.49,1.2999999999999999E-2,0.98523884460492495,null,0.49,0.64100000000000001,0.99962643094392278,null,0.49,3.1419999999999999,0.74719216139198497,null,0.49,1.2999999999999999E-2,0.64100000000000001,3.1419999999999999]
[0.5625,9.8000000000000004E-2,0.96663633493889167,null,0.5625,0.78800000000000003,0.99828055186224141,null,0.5625,1.843,0.67015429479387123,null,0.5625,9.8000000000000004E-2,0.78800000000000003,1.843]
[0.64,0.51300000000000001,0.92845782586845316,null,0.64,0.93600000000000005,0.99282864578861851,null,0.64,0.65600000000000003,0.57696835542469893,null,0.64,0.51300000000000001,0.93600000000000005,0.65600000000000003]
[0.72250000000000003,1.7230000000000001,0.85352627268618086,null,0.72250000000000003,1.0629999999999999,0.97257157425316487,null,0.72250000000000003,0.129,0.46558145272853246,null,0.72250000000000003,1.7230000000000001,1.0629999999999999,0.129]
[0.81,3.339,0.71215106024670227,null,0.81,1.143,0.90283933073418454,null,0.81,1.2999999999999999E-2,0.33382790217046698,null,0.81,3.339,1.143,1.2999999999999999E-2]
[0.90249999999999997,3.3420000000000001,0.45461666716012772,null,0.90249999999999997,1.1499999999999999,0.67857925677224928,null,0.90249999999999997,1E-3,0.17943021106447998,null,0.90249999999999997,3.3420000000000001,1.1499999999999999,1E-3]
[1,1.538,0,null,1,1.071,0,null,1,0,0,null,1,1.538,1.071,0]
[1.0900000000000001,0.37,null,null,1.0900000000000001,0.93500000000000005,null,null,1.0900000000000001,0,null,null,1.0900000000000001,0.37,0.93500000000000005,0]
[1.1825000000000001,4.2000000000000003E-2,null,null,1.1825000000000001,0.75600000000000001,null,null,1.1825000000000001,0,null,null,1.1825000000000001,4.2000000000000003E-2,0.75600000000000001,0]
[1.2749999999999999,2E-3,null,null,1.2749999999999999,0.56999999999999995,null,null,1.2749999999999999,0,null,null,1.2749999999999999,2E-3,0.56999999999999995,0]
[1.3674999999999999,0,null,null,1.3674999999999999,0.39900000000000002,null,null,1.3674999999999999,0,null,null,1.3674999999999999,0,0.39900000000000002,0]
[1.46,0,null,null,1.46,0.26,null,null,1.46,0,null,null,1.46,0,0.26,0]
[1.5,0,null,null,1.5,0.21199999999999999,null,null,1.5,0,null,null,1.5,0,0.21199999999999999,0]
[null,0,null,null,null,0.05,null,null,null,2E-3]
[]
[null,"Scale weights"]
[null,null,"CO2","Dem","Con"]
[{"$f":"SUM(B28,F28,J28)","v":0.5659213761714289},"D StdDev",{"$f":"B28/A61","v":0.19292370692842709},{"$f":"F28/A61","v":0.60911785826914311},{"$f":"J28/A61","v":0.19795843480242978}]
[{"$f":"1/B28+1/F28+1/J28","v":20.98644893111787},"I StdDev",{"$f":"1/B28/A62","v":0.43643477176768936},{"$f":"1/F28/A62","v":0.13823041445729692},{"$f":"1/J28/A62","v":0.42533481377501381},null,null,null,null,null,null,null,null,null,null,null,null,null,null,null,null,0.02]
[null,"Arbitrary",0.4,0.3,0.3,null,null,null,null,null,null,null,null,null,null,null,null,null,null,null,null,"First stage",null,null,"Weighted"]
[null,"linear",0.33333332999999998,0.33333332999999998,0.33333332999999998,null,null,null,null,null,null,"kgCO2/m2","kgCO2/m2","MJ/m2","MJ/m2","MJ/m2","MJ/m2",null,"CO2","Dem","Con","CO2","Dem","Con","CO2","Dem","Con"]
[null,"Used",{"$f":"C62","v":0.43643477176768936},{"$f":"D62","v":0.13823041445729692},{"$f":"E62","v":0.42533481377501381},null,null,null,"IFsap",{"$f":"1-(1-0.25)*(1-0.25)","v":0.4375},null,"TER","BER","Dn","Da","Cn","Ca",null,"% A/N","% A/N","% A/N","EPR","EPR","EPR",null,null,null,"EPR"]
[null,null,null,null,null,null,null,null,"IF",{"$f":"J65","v":0.4375},null,{"$f":"IF(AD_MultiRes_option02=1,Ene01_06,Ene01_48)","v":0},{"$f":"IF(AD_MultiRes_option02=1,Ene01_07,Ene01_49)","v":0},{"$f":"IF(AD_MultiRes_option02=1,Ene01_02,Ene01_44)","v":0},{"$f":"IF(AD_MultiRes_option02=1,Ene01_03,Ene01_45)","v":0},{"$f":"IF(AD_MultiRes_option02=1,Ene01_04,Ene01_46)","v":0},{"$f":"IF(AD_MultiRes_option02=1,Ene01_05,Ene01_47)","v":0},null,{"$f":"IF(L66=0,1,(M66/L66))","v":1},{"$f":"IF(N66=0,1,(O66/N66))","v":1},{"$f":"IF(P66=0,1,(Q66/P66))","v":1},{"$f":"IF(S66>1,0,IF(VLOOKUP(S66,$E$91:$F$191,2,1)<V62,0,VLOOKUP(S66,$E$91:$F$191,2,1)))","v":5.7665987427392373E-2},{"$f":"IF(T66>1,0,IF(VLOOKUP(T66,$M$91:$N$191,2,1)<V62,0,VLOOKUP(T66,$M$91:$N$191,2,1)))","v":0},{"$f":"IF(U66>1,0,IF(VLOOKUP(U66,$T$91:$U$191,2,1)<V62,0,VLOOKUP(U66,$T$91:$U$191,2,1)))","v":0},{"$f":"V66*C65","v":2.5167442061632433E-2},{"$f":"W66*D65","v":0},{"$f":"X66*E65","v":0},{"$f":"IF(V66>1,0,V66*$C$65+W66*$D$65+X66*$E$65)","v":2.5167442061632433E-2}]
[]
[]
[null,"CO2","Use Bezier?",null,0,null,null,null,"Demand","Use Bezier?",null,null,1,null,null,null,"Consumption","Use Bezier?",null,1]
[null,null,null,"Bezier","key slope",null,null,null,null,null,"Bezier",null,"key slope",null,null,null,null,null,"Bezier","key slope"]
[null,null,null,"Demand",{"$f":"-$C$28*$B$27^($C$28-1)","v":-2.7603774887810615},null,null,null,null,null,"Demand",null,{"$f":"-$G$28*$F$27^($G$28-1)","v":-2.5592507325959488},null,null,null,null,null,"Demand",{"$f":"-$K$28*$J$27^($K$28-1)","v":-0.88850980782411104}]
[null,null,null,"x","y",null,null,null,null,null,"x",null,"y",null,null,null,null,null,"x","y"]
[null,null,1,{"$f":"$B$27","v":0.85637583254621708},{"$f":"$C$27","v":0.6},null,null,null,null,1,{"$f":"$F$27","v":0.86461760189420733},null,{"$f":"$G$27","v":0.8},null,null,null,null,1,{"$f":"$J$27","v":0.43391787655382008},{"$f":"$K$27","v":0.8}]
[null,null,2,{"$f":"(-$C$28+E73-E71*D73)/(-$C$28-E71)","v":0.93537132967104009},{"$f":"-$C$28*(D74-1)","v":0.38194260802156932},null,null,null,null,2,{"$f":"(-$G$28+M73-M71*K73)/(-$G$28-M71)","v":0.9466733678214776},null,{"$f":"-$G$28*(K74-1)","v":0.58999872093691308},null,null,null,null,2,{"$f":"(-$K$28+T73-T71*S73)/(-$K$28-T71)","v":0.71417160174938277},{"$f":"-$K$28*(S74-1)","v":0.55099181648449935}]
[null,null,3,{"$f":"IF(E69,MAX(D73,1-$J$66),1)","v":1},0,null,null,null,null,3,{"$f":"IF(M69,MAX(K73,1-$J$66),1)","v":0.86461760189420733},null,0,null,null,null,null,3,{"$f":"IF(T69,MAX(S73,1-$J$66),1)","v":0.5625},0]
[null,null,4,1,0,null,null,null,null,4,1,null,0,null,null,null,null,4,1,0]
[null,"Integers","          t","Dx","Dy",null,null,null,"Integers","          t","Dx",null,"Dy",null,null,null,"Integers","          t","Dx","Dy"]
[null,0,{"$f":"0.001*B78","v":0},{"$f":"$D$73*(1-C78)^3+$D$74*3*(1-C78)^2*C78+$D$75*3*(1-C78)*C78^2+$D$76*C78^3","v":0.85637583254621708},{"$f":"$E$73*(1-C78)^3+$E$74*3*(1-C78)^2*C78+$E$75*3*(1-C78)*C78^2+$E$76*C78^3","v":0.6},null,null,null,0,{"$f":"0.001*I78","v":0},{"$f":"$K$73*(1-J78)^3+$K$74*3*(1-J78)^2*J78+$K$75*3*(1-J78)*J78^2+$K$76*J78^3","v":0.86461760189420733},null,{"$f":"$M$73*(1-J78)^3+$M$74*3*(1-J78)^2*J78+$M$75*3*(1-J78)*J78^2+$M$76*J78^3","v":0.8},null,null,null,0,{"$f":"0.001*Q78","v":0},{"$f":"$S$73*(1-R78)^3+$S$74*3*(1-R78)^2*R78+$S$75*3*(1-R78)*R78^2+$S$76*R78^3","v":0.43391787655382008},{"$f":"$T$73*(1-R78)^3+$T$74*3*(1-R78)^2*R78+$T$75*3*(1-R78)*R78^2+$T$76*R78^3","v":0.8}]
[null,{"$f":"B78+1","v":1},{"$f":"0.1*B79","v":0.1},0.87959321503625509,0.53021205374924141,null,null,null,{"$f":"I78+1","v":1},{"$f":"0.1*I79","v":0.1},0.88469253541263981,null,0.72656968918766995,null,null,null,{"$f":"Q78+1","v":1},{"$f":"0.1*Q79","v":0.1},0.50605733123283492,0.71709101140573339]
[null,2,0.2,0.90164701685734272,0.45386596148028269,null,null,null,2,0.2,0.89721007519512563,null,0.63615950883977479,null,null,null,2,0.2,0.55840784786731901,0.62118085753004793]
[null,3,0.30000000000000004,0.92223566694828107,0.37423669013751204,null,null,null,3,0.30000000000000004,0.90445951941698988,null,0.53458943593317865,null,null,null,3,0.30000000000000004,0.59709600802943807,0.51738739106966414]
[null,4,0.4,0.94105759424787228,0.29459920666531791,null,null,null,4,0.4,0.90873016625355896,null,0.42767944744474645,null,null,null,4,0.4,0.62824839329135862,0.41082846472130374]
[null,5,0.5,0.95781122769491711,0.21822847800808848,null,null,null,5,0.5,0.91231131388015774,null,0.32124952035134241,null,null,null,5,0.5,0.65799158522524603,0.30662193118168724]
[null,6,0.60000000000000009,0.97219499622821737,0.1483994711102119,null,null,null,6,0.60000000000000009,0.91749226047211241,null,0.22111963162983087,null,null,null,6,0.60000000000000009,0.69245216540326671,0.20988564314753572]
[null,7,0.70000000000000007,0.98390732878657439,8.8387152916076545E-2,null,null,null,7,0.70000000000000007,0.92656230420474828,null,0.13310975825707652,null,null,null,7,0.70000000000000007,0.73775671539758658,0.12573745331557032]
[null,8,0.8,0.99264665430878973,4.1466490370070636E-2,null,null,null,8,0.8,0.9418107432533912,null,6.3039877209943612E-2,null,null,null,8,0.8,0.80003181678037139,5.929521438251191E-2]
[null,9,0.9,0.99811140173366431,1.0912450416582366E-2,null,null,null,9,0.9,0.9655268757933666,null,1.6729965465296644E-2,null,null,null,9,0.9,0.88540405112378717,1.5676779045081475E-2]
[null,10,1,1,0,null,null,null,10,1,1,null,0,null,null,null,10,1,1,0]
[null,null,null,null,null,null,null,"dupY?",null,null,null,null,null,null,null,"dupY?",null,null,null,null,null,null,"dupY?"]
[null,"X",null,"t","x","y","yold",{"$f":"SUM(H91:H191)","v":0},"X",null,"t",null,"x","y","yold",{"$f":"SUM(P91:P191)","v":0},"X",null,"t","x","y","yold",{"$f":"SUM(W91:W191)","v":0}]
[null,0,{"$f":"IF(B91<$B$27,0,1)","v":0},{"$f":"0","v":0},{"$f":"IF(AND(C91,$E$69),$D$73*(1-D91)^3+$D$74*3*(1-D91)^2*D91+$D$75*3*(1-D91)*D91^2+$D$76*D91^3,B91)","v":0},{"$f":"IF(AND(C91,$E$69),$E$73*(1-D91)^3+$E$74*3*(1-D91)^2*D91+$E$75*3*(1-D91)*D91^2+$E$76*D91^3,1-E91^$C$28)","v":1},{"$f":"1-E91^$C$28","v":1},{"$f":"E91","v":0},0,{"$f":"IF(I91<$F$27,0,1)","v":0},{"$f":"0","v":0},null,{"$f":"IF(AND(J91,$M$69),$K$73*(1-K91)^3+$K$74*3*(1-K91)^2*K91+$K$75*3*(1-K91)*K91^2+$K$76*K91^3,I91)","v":0},{"$f":"IF(AND(J91,$M$69),$M$73*(1-K91)^3+$M$74*3*(1-K91)^2*K91+$M$75*3*(1-K91)*K91^2+$M$76*K91^3,1-M91^$G$28)","v":1},{"$f":"1-M91^$G$28","v":1},{"$f":"M91","v":0},0,{"$f":"IF(Q91<$J$27,0,1)","v":0},{"$f":"0","v":0},{"$f":"IF(AND(R91,$T$69),$S$73*(1-S91)^3+$S$74*3*(1-S91)^2*S91+$S$75*3*(1-S91)*S91^2+$S$76*S91^3,Q91)","v":0},{"$f":"IF(AND(R91,$T$69),$T$73*(1-S91)^3+$T$74*3*(1-S91)^2*S91+$T$75*3*(1-S91)*S91^2+$T$76*S91^3,1-T91^$K$28)","v":1},{"$f":"1-T91^$K$28","v":1},{"$f":"T91","v":0}]
[null,{"$f":"B91+0.01","v":0.01},0,{"$f":"IF(C92,D91+1/SUM($C$91:$C$191),0)","v":0},0.01,0.9999999999984851,0.9999999999984851,{"$f":"IF(E92<=E91,1,0)","v":0},{"$f":"I91+0.01","v":0.01},0,{"$f":"IF(J92,K91+1/SUM($J$91:$J$191),0)","v":0},null,0.01,1,1,{"$f":"IF(M92<=M91,1,0)","v":0},{"$f":"Q91+0.01","v":0.01},0,{"$f":"IF(R92,S91+1/SUM($R$91:$R$191),0)","v":0},{"$f":"IF(AND(R92,$T$69),$S$73*(1-S92)^3+$S$74*3*(1-S92)^2*S92+$S$75*3*(1-S92)*S92^2+$S$76*S92^3,Q92)","v":0.01},0.99986049264366283,0.99986049264366283,{"$f":"IF(T92<=T91,1,0)","v":0}]
[null,0.02,0,0,0.02,0.99999999990891963,0.99999999990891963,0,0.02,0,0,null,0.02,1,1,0,0.02,0,0,0.02,0.99946924625563793,0.99946924625563793,0]
[null,0.03,0,0,0.03,0.99999999899979497,0.99999999899979497,0,0.03,0,0,null,0.03,1,1,0,0.03,0,0,0.03,0.99884030324661821,0.99884030324661821,0]
[null,0.04,0,0,0.04,0.99999999452414245,0.99999999452414245,0,0.04,0,0,null,0.04,0.99999999999999967,0.99999999999999967,0,0.04,0,0,0.04,0.99798075496124039,0.99798075496124039,0]
[null,0.05,0,0,0.05,0.99999997952749065,0.99999997952749065,0,0.05,0,0,null,0.05,0.999999999999996,0.999999999999996,0,0.05,0,0,0.05,0.99689542184951774,0.99689542184951774,0]
[null,6.0000000000000005E-2,0,0,6.0000000000000005E-2,0.99999993986649505,0.99999993986649505,0,6.0000000000000005E-2,0,0,null,6.0000000000000005E-2,0.99999999999996969,0.99999999999996969,0,6.0000000000000005E-2,0,0,6.0000000000000005E-2,0.99558795026769598,0.99558795026769598,0]
[null,7.0000000000000007E-2,0,0,7.0000000000000007E-2,0.99999985045952666,0.99999985045952666,0,7.0000000000000007E-2,0,0,null,7.0000000000000007E-2,0.99999999999983313,0.99999999999983313,0,7.0000000000000007E-2,0,0,7.0000000000000007E-2,0.99406126669856965,0.99406126669856965,0]
[null,0.08,0,0,0.08,0.99999967078497953,0.99999967078497953,0,0.08,0,0,null,0.08,0.99999999999926892,0.99999999999926892,0,0.08,0,0,0.08,0.99231781109437767,0.99231781109437767,0]
[null,0.09,0,0,0.09,0.99999933963979781,0.99999933963979781,0,0.09,0,0,null,0.09,0.99999999999730926,0.99999999999730926,0,0.09,0,0,0.09,0.99035967281500337,0.99035967281500337,0]
[null,9.9999999999999992E-2,0,0,9.9999999999999992E-2,0.99999876916857833,0.99999876916857833,0,9.9999999999999992E-2,0,0,null,9.9999999999999992E-2,0.99999999999136757,0.99999999999136757,0,9.9999999999999992E-2,0,0,9.9999999999999992E-2,0.98818867677450273,0.98818867677450273,0]
[null,0.10999999999999999,0,0,0.10999999999999999,0.99999783817206478,0.99999783817206478,0,0.10999999999999999,0,0,null,0.10999999999999999,0.99999999997522027,0.99999999997522027,0,0.10999999999999999,0,0,0.10999999999999999,0.98580644145469243,0.98580644145469243,0]
[null,0.11999999999999998,0,0,0.11999999999999998,0.99999638470271102,0.99999638470271102,0,0.11999999999999998,0,0,null,0.11999999999999998,0.99999999993510902,0.99999999993510902,0,0.11999999999999998,0,0,0.11999999999999998,0.98321441981831981,0.98321441981831981,0]
[null,0.12999999999999998,0,0,0.12999999999999998,0.99999419795409417,0.99999419795409417,0,0.12999999999999998,0,0,null,0.12999999999999998,0.99999999984267862,0.99999999984267862,0,0.12999999999999998,0,0,0.12999999999999998,0.98041392922959791,0.98041392922959791,0]
[null,0.13999999999999999,0,0,0.13999999999999999,0.99999100945025632,0.99999100945025632,0,0.13999999999999999,0,0,null,0.13999999999999999,0.99999999964283004,0.99999999964283004,0,0.13999999999999999,0,0,0.13999999999999999,0.97740617398781737,0.97740617398781737,0]
[null,0.15,0,0,0.15,0.99998648354046737,0.99998648354046737,0,0.15,0,0,null,0.15,0.99999999923372618,0.99999999923372618,0,0.15,0,0,0.15,0.97419226271457238,0.97419226271457238,0]
[null,0.16,0,0,0.16,0.99998020720442515,0.99998020720442515,0,0.16,0,0,null,0.16,0.99999999843508769,0.99999999843508769,0,0.16,0,0,0.16,0.97077322204643479,0.97077322204643479,0]
[null,0.17,0,0,0.17,0.99997167917249952,0.99997167917249952,0,0.17,0,0,null,0.17,0.99999999693951769,0.99999999693951769,0,0.17,0,0,0.17,0.96715000760732139,0.96715000760732139,0]
[null,0.18000000000000002,0,0,0.18000000000000002,0.99996029836528189,0.99996029836528189,0,0.18000000000000002,0,0,null,0.18000000000000002,0.99999999423983832,0.99999999423983832,0,0.18000000000000002,0,0,0.18000000000000002,0.96332351293400109,0.96332351293400109,0]
[null,0.19000000000000003,0,0,0.19000000000000003,0.99994535165639875,0.99994535165639875,0,0.19000000000000003,0,0,null,0.19000000000000003,0.99999998952325497,0.99999998952325497,0,0.19000000000000003,0,0,0.19000000000000003,0.95929457683226849,0.95929457683226849,0]
[null,0.20000000000000004,0,0,0.20000000000000004,0.99992600096228834,0.99992600096228834,0,0.20000000000000004,0,0,null,0.20000000000000004,0.9999999815205336,0.9999999815205336,0,0.20000000000000004,0,0,0.20000000000000004,0.95506398950997495,0.95506398950997495,0]
[null,0.21000000000000005,0,0,0.21000000000000005,0.99990126966240744,0.99990126966240744,0,0.21000000000000005,0,0,null,0.21000000000000005,0.99999996829520177,0.99999996829520177,0,0.21000000000000005,0,0,0.21000000000000005,0.95063249774281566,0.95063249774281566,0]
[null,0.22000000000000006,0,0,0.22000000000000006,0.99987002835312966,0.99987002835312966,0,0.22000000000000006,0,0,null,0.22000000000000006,0.99999994695401062,0.99999994695401062,0,0.22000000000000006,0,0,0.22000000000000006,0.94600080926530783,0.94600080926530783,0]
[null,0.23000000000000007,0,0,0.23000000000000007,0.99983097993841752,0.99983097993841752,0,0.23000000000000007,0,0,null,0.23000000000000007,0.99999991325544824,0.99999991325544824,0,0.23000000000000007,0,0,0.23000000000000007,0.94116959653390597,0.94116959653390597,0]
[null,0.24000000000000007,0,0,0.24000000000000007,0.99978264406018202,0.99978264406018202,0,0.24000000000000007,0,0,null,0.24000000000000007,0.99999986108788175,0.99999986108788175,0,0.24000000000000007,0,0,0.24000000000000007,0.93613949997601709,0.93613949997601709,0]
[null,0.25000000000000006,0,0,0.25000000000000006,0.99972334087109949,0.99972334087109949,0,0.25000000000000006,0,0,null,0.25000000000000006,0.99999978178287052,0.99999978178287052,0,0.25000000000000006,0,0,0.25000000000000006,0.9309111308140855,0.9309111308140855,0]
[null,0.26000000000000006,0,0,0.26000000000000006,0.99965117415251914,0.99965117415251914,0,0.26000000000000006,0,0,null,0.26000000000000006,0.999999663222224,0.999999663222224,0,0.26000000000000006,0,0,0.26000000000000006,0.92548507353543319,0.92548507353543319,0]
[null,0.27000000000000007,0,0,0.27000000000000007,0.99956401377997262,0.99956401377997262,0,0.27000000000000007,0,0,null,0.27000000000000007,0.9999994886894007,0.9999994886894007,0,0.27000000000000007,0,0,0.27000000000000007,0.91986188806446523,0.91986188806446523,0]
[null,0.28000000000000008,0,0,0.28000000000000008,0.99945947753868714,0.99945947753868714,0,0.28000000000000008,0,0,null,0.28000000000000008,0.99999923540676039,0.99999923540676039,0,0.28000000000000008,0,0,0.28000000000000008,0.91404211168300364,0.91404211168300364,0]
[null,0.29000000000000009,0,0,0.29000000000000009,0.99933491229139648,0.99933491229139648,0,0.29000000000000009,0,0,null,0.29000000000000009,0.99999887268988474,0.99999887268988474,0,0.29000000000000009,0,0,0.29000000000000009,0.90802626073606463,0.90802626073606463,0]
[null,0.3000000000000001,0,0,0.3000000000000001,0.99918737450065653,0.99918737450065653,0,0.3000000000000001,0,0,null,0.3000000000000001,0.99999835963857897,0.99999835963857897,0,0.3000000000000001,0,0,0.3000000000000001,0.90181483215374802,0.90181483215374802,0]
[null,0.31000000000000011,0,0,0.31000000000000011,0.99901361010777734,0.99901361010777734,0,0.31000000000000011,0,0,null,0.31000000000000011,0.9999976422711423,0.9999976422711423,0,0.31000000000000011,0,0,0.31000000000000011,0.89540830481463174,0.89540830481463174,0]
[null,0.32000000000000012,{"$f":"IF(B123<$B$27,0,1)","v":0},0,{"$f":"IF(AND(C123,$E$69),$D$73*(1-D123)^3+$D$74*3*(1-D123)^2*D123+$D$75*3*(1-D123)*D123^2+$D$76*D123^3,B123)","v":0.32000000000000012},{"$f":"IF(AND(C123,$E$69),$E$73*(1-D123)^3+$E$74*3*(1-D123)^2*D123+$E$75*3*(1-D123)*D123^2+$E$76*D123^3,1-E123^$C$28)","v":0.99881003377040856},{"$f":"1-E123^$C$28","v":0.99881003377040856},0,0.32000000000000012,{"$f":"IF(I123<$F$27,0,1)","v":0},0,null,{"$f":"IF(AND(J123,$M$69),$K$73*(1-K123)^3+$K$74*3*(1-K123)^2*K123+$K$75*3*(1-K123)*K123^2+$K$76*K123^3,I123)","v":0.32000000000000012},{"$f":"IF(AND(J123,$M$69),$M$73*(1-K123)^3+$M$74*3*(1-K123)^2*K123+$M$75*3*(1-K123)*K123^2+$M$76*K123^3,1-M123^$G$28)","v":0.999996649993936},{"$f":"1-M123^$G$28","v":0.999996649993936},0,0.32000000000000012,{"$f":"IF(Q123<$J$27,0,1)","v":0},0,{"$f":"IF(AND(R123,$T$69),$S$73*(1-S123)^3+$S$74*3*(1-S123)^2*S123+$S$75*3*(1-S123)*S123^2+$S$76*S123^3,Q123)","v":0.32000000000000012},{"$f":"IF(AND(R123,$T$69),$T$73*(1-S123)^3+$T$74*3*(1-S123)^2*S123+$T$75*3*(1-S123)*S123^2+$T$76*S123^3,1-T123^$K$28)","v":0.88880714077183787},{"$f":"1-T123^$K$28","v":0.88880714077183787},0]
[null,{"$f":"B123+0.01","v":0.33000000000000013},0,{"$f":"IF(C124,D123+1/SUM($C$91:$C$191),0)","v":0},0.33000000000000013,0.99857270746073679,0.99857270746073679,{"$f":"IF(E124<=E123,1,0)","v":0},{"$f":"I123+0.01","v":0.33000000000000013},0,{"$f":"IF(J124,K123+1/SUM($J$91:$J$191),0)","v":0},null,0.33000000000000013,0.99999529128207199,0.99999529128207199,{"$f":"IF(M124<=M123,1,0)","v":0},{"$f":"Q123+0.01","v":0.33000000000000013},0,{"$f":"IF(R124,S123+1/SUM($R$91:$R$191),0)","v":0},0.33000000000000013,0.8820117863595287,0.8820117863595287,{"$f":"IF(T124<=T123,1,0)","v":0}]
[null,0.34000000000000014,0,0,0.34000000000000014,0.99829731842618386,0.99829731842618386,0,0.34000000000000014,0,0,null,0.34000000000000014,0.99999344842907034,0.99999344842907034,0,0.34000000000000014,0,0,0.34000000000000014,0.87502267319481453,0.87502267319481453,0]
[null,0.35000000000000014,0,0,0.35000000000000014,0.99797915651443125,0.99797915651443125,0,0.35000000000000014,0,0,null,0.35000000000000014,0.99999097120345448,0.99999097120345448,0,0.35000000000000014,0,0,0.35000000000000014,0.86784021908779141,0.86784021908779141,0]
[null,0.36000000000000015,0,0,0.36000000000000015,0.99761309086453154,0.99761309086453154,0,0.36000000000000015,0,0,null,0.36000000000000015,0.99998766922835602,0.99998766922835602,0,0.36000000000000015,0,0,0.36000000000000015,0.86046482887055131,0.86046482887055131,0]
[null,0.37000000000000016,0,0,0.37000000000000016,0.99719354596581489,0.99719354596581489,0,0.37000000000000016,0,0,null,0.37000000000000016,0.9999833028761328,0.9999833028761328,0,0.37000000000000016,0,0,0.37000000000000016,0.85289689515446077,0.85289689515446077,0]
[null,0.38000000000000017,0,0,0.38000000000000017,0.99671447708623939,0.99671447708623939,0,0.38000000000000017,0,0,null,0.38000000000000017,0.99997757244364116,0.99997757244364116,0,0.38000000000000017,0,0,0.38000000000000017,0.8451367990237113,0.8451367990237113,0]
[null,0.39000000000000018,0,0,0.39000000000000018,0.99616934507178834,0.99616934507178834,0,0.39000000000000018,0,0,null,0.39000000000000018,0.9999701053449882,0.9999701053449882,0,0.39000000000000018,0,0,0.39000000000000018,0.83718491067206124,0.83718491067206124,0]
[null,0.40000000000000019,0,0,0.40000000000000019,0.99555109051846646,0.99555109051846646,0,0.40000000000000019,0,0,null,0.40000000000000019,0.99996044102718584,0.99996044102718584,0,0.40000000000000019,0,0,0.40000000000000019,0.82904158998877742,0.82904158998877742,0]
[null,0.4100000000000002,0,0,0.4100000000000002,0.99485210731840312,0.99485210731840312,0,0.4100000000000002,0,0,null,0.4100000000000002,0.99994801327997263,0.99994801327997263,0,0.4100000000000002,0,0,0.4100000000000002,0.82070718709901502,0.82070718709901502,0]
[null,0.42000000000000021,0,0,0.42000000000000021,0.99406421558152813,0.99406421558152813,0,0.42000000000000021,0,0,null,0.42000000000000021,0.99993212957401234,0.99993212957401234,0,0.42000000000000021,0,0,0.42000000000000021,0.81218204286321438,0.81218204286321438,0]
[null,0.43000000000000022,0,0,0.43000000000000022,0.99317863393424455,0.99317863393424455,0,0.43000000000000022,0,0,null,0.43000000000000022,0.9999119470215535,0.9999119470215535,0,0.43000000000000022,0,0,0.43000000000000022,0.80346648933953702,0.80346648933953702,0]
[null,0.44000000000000022,0,0,0.44000000000000022,0.99218595119648556,0.99218595119648556,0,0.44000000000000022,0,0,null,0.44000000000000022,0.99988644451027042,0.99988644451027042,0,0.44000000000000022,1,1.7543859649122806E-2,0.44827476329091187,0.78662007208418327,0.7870481467588577,0]
[null,0.45000000000000023,0,0,0.45000000000000023,0.99107609743850433,0.99107609743850433,0,0.45000000000000023,0,0,null,0.45000000000000023,0.99985439051425007,0.99985439051425007,0,0.45000000000000023,1,3.5087719298245612E-2,0.46186708613928767,0.77271009956744408,0.77442604003721216,0]
[null,0.46000000000000024,0,0,0.46000000000000024,0.98983831441871439,0.98983831441871439,0,0.46000000000000024,0,0,null,0.46000000000000024,0.99981430603573884,0.99981430603573884,0,0.46000000000000024,1,5.2631578947368418E-2,0.47472792724337065,0.75829771768813736,0.76216151116369191,0]
[null,0.47000000000000025,0,0,0.47000000000000025,0.98846112540386033,0.98846112540386033,0,0.47000000000000025,0,0,null,0.47000000000000025,0.99976442207716065,0.99976442207716065,0,0.47000000000000025,1,7.0175438596491224E-2,0.48689036874758362,0.74341056168461817,0.75027579388963228,0]
[null,0.48000000000000026,0,0,0.48000000000000026,0.98693230437277246,0.98693230437277246,0,0.48000000000000026,0,0,null,0.48000000000000026,0.99970263098487144,0.99970263098487144,0,0.48000000000000026,1,8.771929824561403E-2,0.49838749279635025,0.72807626679524218,0.73878402755960626,0]
[null,0.49000000000000027,0,0,0.49000000000000027,0.98523884460492495,0.98523884460492495,0,0.49000000000000027,0,0,null,0.49000000000000027,0.99962643094392278,0.99962643094392278,0,0.49000000000000027,1,0.10526315789473684,0.50925238153409358,0.71232246825836454,0.72769572920288228,0]
[null,0.50000000000000022,0,0,0.50000000000000022,0.9833669266549907,0.9833669266549907,0,0.50000000000000022,0,0,null,0.50000000000000022,0.99953286283660314,0.99953286283660314,0,0.50000000000000022,1,0.12280701754385964,0.51951811710523688,0.69617680131234039,0.7170152363743123,0]
[null,0.51000000000000023,0,0,0.51000000000000023,0.98130188571455756,0.98130188571455756,0,0.51000000000000023,0,0,null,0.51000000000000023,0.99941843860647583,0.99941843860647583,0,0.51000000000000023,1,0.14035087719298245,0.52921778165420308,0.67966690119552475,0.70674212223581701,0]
[null,0.52000000000000024,0,0,0.52000000000000024,0.97902817836214584,0.97902817836214584,0,0.52000000000000024,0,0,null,0.52000000000000024,0.99927906019386825,0.99927906019386825,0,0.52000000000000024,1,0.15789473684210525,0.53838445732541551,0.66282040314627289,0.69687158410445327,0]
[null,0.53000000000000025,0,0,0.53000000000000025,0.97652934870263941,0.97652934870263941,0,0.53000000000000025,0,0,null,0.53000000000000025,0.99910992802805121,0.99910992802805121,0,0.53000000000000025,1,0.17543859649122806,0.54705122626329761,0.6456649424029407,0.68739480648216711,0]
[null,0.54000000000000026,0,0,0.54000000000000026,0.97378799389722248,0.97378799389722248,0,0.54000000000000026,0,0,null,0.54000000000000026,0.99890543797549347,0.99890543797549347,0,0.54000000000000026,1,0.19298245614035087,0.55525117061227236,0.62822815420388267,0.67829929941279876,0]
[null,0.55000000000000027,0,0,0.55000000000000027,0.97078572908488614,0.97078572908488614,0,0.55000000000000027,0,0,null,0.55000000000000027,0.99865906555234174,0.99865906555234174,0,0.55000000000000027,1,0.21052631578947367,0.56301737251676287,0.61053767378745427,0.66956921287432691,0]
[null,0.56000000000000028,0,0,0.56000000000000028,0.96750315169655243,0.96750315169655243,0,0.56000000000000028,0,0,null,0.56000000000000028,0.99836323611246414,0.99836323611246414,0,0.56000000000000028,1,0.22807017543859648,0.57038291412119246,0.59262113639201064,0.66118562780172563,0]
[null,0.57000000000000028,0,0,0.57000000000000028,0.96391980516283604,0.96391980516283604,0,0.57000000000000028,0,0,null,0.57000000000000028,0.99800917961976088,0.99800917961976088,0,0.57000000000000028,1,0.24561403508771928,0.57738087756998446,0.57450617725590736,0.65312682424293433,0]
[null,0.58000000000000029,0,0,0.58000000000000029,0.96001414201644975,0.96001414201644975,0,0.58000000000000029,0,0,null,0.58000000000000029,0.99758676850476424,0.99758676850476424,0,0.58000000000000029,1,0.26315789473684209,0.58404434500756208,0.55622043161749957,0.64536852707337022,0]
[null,0.5900000000000003,0,0,0.5900000000000003,0.95576348639023412,0.95576348639023412,0,0.5900000000000003,0,0,null,0.5900000000000003,0.9970843369905944,0.9970843369905944,0,0.5900000000000003,1,0.2807017543859649,0.5904063985783482,0.53779153471514207,0.63788412963012076,0]
[null,0.60000000000000031,0,0,0.60000000000000031,0.95114399591177734,0.95114399591177734,0,0.60000000000000031,0,0,null,0.60000000000000031,0.99648848015184777,0.99648848015184777,0,0.60000000000000031,1,0.2982456140350877,0.59650012042676614,0.51924712178719035,0.63064489557311365,0]
[null,0.61000000000000032,0,0,0.61000000000000032,0.94613062299557094,0.94613062299557094,0,0.61000000000000032,0,0,null,0.61000000000000032,0.99578383084175037,0.99578383084175037,0,0.61000000000000032,1,0.31578947368421051,0.60235859269723935,0.50061482807199986,0.62362013923539361,0]
[null,0.62000000000000033,0,0,0.62000000000000033,0.94069707553362936,0.94069707553362936,0,0.62000000000000033,0,0,null,0.62000000000000033,0.99495281248763923,0.99495281248763923,0,0.62000000000000033,1,0.33333333333333331,0.60801489753419102,0.48192228880792576,0.61677738468670529,0]
[null,0.63000000000000034,0,0,0.63000000000000034,0.9348157769854849,0.9348157769854849,0,0.63000000000000034,0,0,null,0.63000000000000034,0.99397536561229949,0.99397536561229949,0,0.63000000000000034,1,0.35087719298245612,0.61350211708204394,0.46319713923332306,0.61008250370279338,0]
[null,0.64000000000000035,{"$f":"IF(B155<$B$27,0,1)","v":0},0,{"$f":"IF(AND(C155,$E$69),$D$73*(1-D155)^3+$D$74*3*(1-D155)^2*D155+$D$75*3*(1-D155)*D155^2+$D$76*D155^3,B155)","v":0.64000000000000035},{"$f":"IF(AND(C155,$E$69),$E$73*(1-D155)^3+$E$74*3*(1-D155)^2*D155+$E$75*3*(1-D155)*D155^2+$E$76*D155^3,1-E155^$C$28)","v":0.92845782586845294},{"$f":"1-E155^$C$28","v":0.92845782586845294},0,0.64000000000000035,{"$f":"IF(I155<$F$27,0,1)","v":0},0,null,{"$f":"IF(AND(J155,$M$69),$K$73*(1-K155)^3+$K$74*3*(1-K155)^2*K155+$K$75*3*(1-K155)*K155^2+$K$76*K155^3,I155)","v":0.64000000000000035},{"$f":"IF(AND(J155,$M$69),$M$73*(1-K155)^3+$M$74*3*(1-K155)^2*K155+$M$75*3*(1-K155)*K155^2+$M$76*K155^3,1-M155^$G$28)","v":0.9928286457886184},{"$f":"1-M155^$G$28","v":0.9928286457886184},0,0.64000000000000035,{"$f":"IF(Q155<$J$27,0,1)","v":1},0.36842105263157893,{"$f":"IF(AND(R155,$T$69),$S$73*(1-S155)^3+$S$74*3*(1-S155)^2*S155+$S$75*3*(1-S155)*S155^2+$S$76*S155^3,Q155)","v":0.61885333348522142},{"$f":"IF(AND(R155,$T$69),$T$73*(1-S155)^3+$T$74*3*(1-S155)^2*S155+$T$75*3*(1-S155)*S155^2+$T$76*S155^3,1-T155^$K$28)","v":0.44446701458654697},{"$f":"1-T155^$K$28","v":0.6034998328063288},0]
[null,{"$f":"B155+0.01","v":0.65000000000000036},0,{"$f":"IF(C156,D155+1/SUM($C$91:$C$191),0)","v":0},0.65000000000000036,0.921592954649047,0.921592954649047,{"$f":"IF(E156<=E155,1,0)","v":0},{"$f":"I155+0.01","v":0.65000000000000036},0,{"$f":"IF(J156,K155+1/SUM($J$91:$J$191),0)","v":0},null,0.65000000000000036,0.99148669057716032,0.99148669057716032,{"$f":"IF(M156<=M155,1,0)","v":0},{"$f":"Q155+0.01","v":0.65000000000000036},1,{"$f":"IF(R156,S155+1/SUM($R$91:$R$191),0)","v":0.38596491228070173},0.62410162888814724,0.42575955010595312,0.59699226952341955,{"$f":"IF(T156<=T155,1,0)","v":0}]
[null,0.66000000000000036,0,0,0.66000000000000036,0.91418948803640676,0.91418948803640676,0,0.66000000000000036,0,0,null,0.66000000000000036,0.98992005283034568,0.98992005283034568,0,0.66000000000000036,1,0.40350877192982454,0.62928008543524394,0.4071023810298966,0.59052134798175215,0]
[null,0.67000000000000037,0,0,0.67000000000000037,0.9062143006785881,0.9062143006785881,0,0.67000000000000037,0,0,null,0.67000000000000037,0.98809539757266662,0.98809539757266662,0,0.67000000000000037,1,0.42105263157894735,0.63442178527093485,0.38852314259673226,0.58404729396203225,0]
[null,0.68000000000000038,0,0,0.68000000000000038,0.89763277426255017,0.89763277426255017,0,0.68000000000000038,0,0,null,0.68000000000000038,0.98597505948350816,0.98597505948350816,0,0.68000000000000038,1,0.43859649122807015,0.63955981053964328,0.37004947004481559,0.57752905950325117,0]
[null,0.69000000000000039,0,0,0.69000000000000039,0.88840875401865982,0.88840875401865982,0,0.69000000000000039,0,0,null,0.69000000000000039,0.98351655781738379,0.98351655781738379,0,0.69000000000000039,1,0.45614035087719296,0.64472724338579257,0.35170899861250216,0.57092433715401802,0]
[null,0.7000000000000004,0,0,0.7000000000000004,0.87850450463052088,0.87850450463052088,0,0.7000000000000004,0,0,null,0.7000000000000004,0.98067206539546337,0.98067206539546337,0,0.7000000000000004,1,0.47368421052631576,0.64995716595380582,0.33352936353814683,0.56418955395656656,0]
[null,0.71000000000000041,0,0,0.71000000000000041,0.86788066555092214,0.86788066555092214,0,0.71000000000000041,0,0,null,0.71000000000000041,0.9773878280918582,0.9773878280918582,0,0.71000000000000041,1,0.49122807017543857,0.6552826603881059,0.31553820006010475,0.55727984524681684,0]
[null,0.72000000000000042,0,0,0.72000000000000042,0.85649620572468588,0.85649620572468588,0,0.72000000000000042,0,0,null,0.72000000000000042,0.97360353101795505,0.97360353101795505,0,0.72000000000000042,1,0.50877192982456143,0.66073680883311658,0.29776314341673138,0.55014900835285285,0]
[null,0.73000000000000043,0,0,0.73000000000000043,0.84430837771918676,0.84430837771918676,0,0.73000000000000043,0,0,null,0.73000000000000043,0.96925160737784444,0.96925160737784444,0,0.73000000000000043,1,0.52631578947368429,0.66635269343326065,0.28023182884638181,0.54274943627519401,0]
[null,0.74000000000000044,0,0,0.74000000000000044,0.83127267126329774,0.83127267126329774,0,0.74000000000000044,0,0,null,0.74000000000000044,0.96425648572727063,0.96425648572727063,0,0.74000000000000044,1,0.54385964912280715,0.67216339633296163,0.26297189158741141,0.53503203143508582,0]
[null,0.75000000000000044,0,0,0.75000000000000044,0.81734276619550883,0.81734276619550883,0,0.75000000000000044,0,0,null,0.75000000000000044,0.95853377111722626,0.95853377111722626,0,0.75000000000000044,1,0.56140350877193002,0.6782019996766423,0.24601096687817534,0.526946099581585,0]
[null,0.76000000000000045,0,0,0.76000000000000045,0.80247048482195427,0.80247048482195427,0,0.76000000000000045,0,0,null,0.76000000000000045,0.9519893553410107,0.9519893553410107,0,0.76000000000000045,1,0.57894736842105288,0.6845015856087262,0.2293766899570289,0.51843922395423803,0]
[null,0.77000000000000046,0,0,0.77000000000000046,0.78660574368507175,0.78660574368507175,0,0.77000000000000046,0,0,null,0.77000000000000046,0.94451845122994804,0.94451845122994804,0,0.77000000000000046,1,0.59649122807017574,0.69109523627363634,0.2130966960623272,0.50945711980552633,0]
[null,0.78000000000000047,0,0,0.78000000000000047,0.76969650474360551,0.76969650474360551,0,0.78000000000000047,0,0,null,0.78000000000000047,0.93600454565769131,0.93600454565769131,0,0.78000000000000047,1,0.6140350877192986,0.69801603381579613,0.19719862043242561,0.49994346939572587,0]
[null,0.79000000000000048,0,0,0.79000000000000048,0.7516887259646583,0.7516887259646583,0,0.79000000000000048,0,0,null,0.79000000000000048,0.92631826561580111,0.92631826561580111,0,0.79000000000000048,1,0.63157894736842146,0.70529706037962869,0.18171009830567933,0.48983973758227073,0]
[null,0.80000000000000049,0,0,0.80000000000000049,0.73252631132848345,0.73252631132848345,0,0.80000000000000049,0,0,null,0.80000000000000049,0.91531615141373412,0.91531615141373412,0,0.80000000000000049,1,0.64912280701754432,0.7129713981095569,0.16665876492044351,0.47908496813586043,0]
[null,0.8100000000000005,0,0,0.8100000000000005,0.71215106024670138,0.71215106024670138,0,0.8100000000000005,0,0,null,0.8100000000000005,0.90283933073418399,0.90283933073418399,0,0.8100000000000005,1,0.66666666666666718,0.72107212915000463,0.15207225551507353,0.46761556092622769,0]
[null,0.82000000000000051,0,0,0.82000000000000051,0.69050261639461297,0.69050261639461297,0,0.82000000000000051,0,0,null,0.82000000000000051,0.88871208693953074,0.88871208693953074,0,0.82000000000000051,1,0.68421052631579005,0.72963233564539443,0.13797820532792449,0.45536503013147567,0]
[null,0.83000000000000052,0,0,0.83000000000000052,0.66751841595827544,0.66751841595827544,0,0.83000000000000052,0,0,null,0.83000000000000052,0.87274031467663227,0.87274031467663227,0,0.83000000000000052,1,0.70175438596491291,0.73868509974014995,0.12440424959735169,0.44226374363592535,0]
[null,0.84000000000000052,0,0,0.84000000000000052,0.6431336352969963,0.6431336352969963,0,0.84000000000000052,0,0,null,0.84000000000000052,0.85470985546497591,0.85470985546497591,0,0.84000000000000052,1,0.71929824561403577,0.74826350357869398,0.11137802356171035,0.42823864379235899,0]
[null,0.85000000000000053,0,0,0.85000000000000053,0.61728113802188922,0.61728113802188922,0,0.85000000000000053,0,0,null,0.85000000000000053,0.83438470557694422,0.83438470557694422,0,0.85000000000000053,1,0.73684210526315863,0.75840062930545005,9.8927162459355733E-2,0.41321294973507694,0]
[null,0.86000000000000054,1,6.6666666666666666E-2,0.86000000000000054,0.58989142149113549,0.58989142149113549,0,0.86000000000000054,0,0,null,0.86000000000000054,0.81150508812827682,0.81150508812827682,0,0.86000000000000054,1,0.75438596491228149,0.76912955906484137,8.7079301528643002E-2,0.39710584144019911,0]
[null,0.87000000000000055,1,0.13333333333333333,0.87000000000000055,0.56089256272257426,0.56089256272257426,0,0.87000000000000055,1,7.1428571428571425E-2,null,0.8798281178283297,0.74953693568331448,0.75743668870263825,0,0.87000000000000055,1,0.77192982456140435,0.78048337500129095,7.5862076007927479E-2,0.37983212573885528,0]
[null,0.88000000000000056,1,0.2,0.88000000000000056,0.53021016372424845,0.53021016372424845,0,0.88000000000000056,1,0.14285714285714285,null,0.89084910369668846,0.68956227947867832,0.72161886252045915,0,0.88000000000000056,1,0.78947368421052722,0.79249515925922198,6.5303121135564357E-2,0.36130188449721512,0]
[null,0.89000000000000057,1,0.26666666666666666,0.89000000000000057,0.49776729624351879,0.49776729624351879,0,0.89000000000000057,1,0.21428571428571427,null,0.89851485183722968,0.62219701424937979,0.69393779829071667,0,0.89000000000000057,1,0.80701754385965008,0.80519799398305802,5.5430072149908874E-2,0.34142010518450683,0]
[null,0.90000000000000058,1,0.33333333333333331,0.90000000000000058,0.46348444593534865,0.46348444593534865,0,0.90000000000000058,1,0.2857142857142857,null,0.90365965458790087,0.54956212285870842,0.67398016477503597,0,0.90000000000000058,1,0.82456140350877294,0.81862496131722184,4.6270564289316266E-2,0.32008629405615829,0]
[null,0.91000000000000059,1,0.39999999999999997,0.91000000000000059,0.4272794559503641,0.4272794559503641,0,0.91000000000000059,1,0.3571428571428571,null,0.90711780428664812,0.4737785881699525,0.65990774293290855,0,0.91000000000000059,1,0.8421052631578958,0.83280914340613676,3.7852232792141768E-2,0.29719407218384442,0]
[null,0.9200000000000006,1,0.46666666666666662,0.9200000000000006,0.38906746994327457,0.38906746994327457,0,0.9200000000000006,1,0.42857142857142849,null,0.90972359327141805,0.39696739304640094,0.64894129694968283,0,0.9200000000000006,1,0.85964912280701866,0.84778362239422622,3.0202712896740615E-2,0.27263075456750607,0]
[null,0.9300000000000006,1,0.53333333333333333,0.9300000000000006,0.34876087450224269,0.34876087450224269,0,0.9300000000000006,1,0.49999999999999989,null,0.91231131388015763,0.32124952035134252,0.63773351390661814,0,0.9300000000000006,1,0.87719298245614152,0.8635814804259131,2.334963984146804E-2,0.24627691256623263,0]
[null,0.94000000000000061,1,0.6,0.94000000000000061,0.30626924099977615,0.30626924099977615,0,0.94000000000000061,1,0.57142857142857129,null,0.91571525845081347,0.24874595294806606,0.62249496687197026,0,0.94000000000000061,1,0.89473684210526438,0.88023579964562082,1.7320648864679277E-2,0.21800591988529749,0]
[null,0.95000000000000062,1,0.66666666666666663,0.95000000000000062,0.2614992668657149,0.2614992668657149,0,0.95000000000000062,1,0.64285714285714268,null,0.920769719321332,0.18157767369986033,0.59878997341659435,0,0.95000000000000062,1,0.91228070175438725,0.89777966219777239,1.2143375204729571E-2,0.18768348235563148,0]
[null,0.96000000000000063,{"$f":"IF(B187<$B$27,0,1)","v":1},0.73333333333333328,{"$f":"IF(AND(C187,$E$69),$D$73*(1-D187)^3+$D$74*3*(1-D187)^2*D187+$D$75*3*(1-D187)*D187^2+$D$76*D187^3,B187)","v":0.96000000000000063},{"$f":"IF(AND(C187,$E$69),$E$73*(1-D187)^3+$E$74*3*(1-D187)^2*D187+$E$75*3*(1-D187)*D187^2+$E$76*D187^3,1-E187^$C$28)","v":0.21435471628287484},0.21435471628287484,0,0.96000000000000063,{"$f":"IF(I187<$F$27,0,1)","v":1},0.71428571428571408,null,0.92830898882966006,{"$f":"IF(AND(J187,$M$69),$M$73*(1-K187)^3+$M$74*3*(1-K187)^2*K187+$M$75*3*(1-K187)*K187^2+$M$76*K187^3,1-M187^$G$28)","v":0.12186566547001411},0.56090877198137212,0,0.96000000000000063,{"$f":"IF(Q187<$J$27,0,1)","v":1},0.92982456140351011,{"$f":"IF(AND(R187,$T$69),$S$73*(1-S187)^3+$S$74*3*(1-S187)^2*S187+$S$75*3*(1-S187)*S187^2+$S$76*S187^3,Q187)","v":0.91624615022679123},{"$f":"IF(AND(R187,$T$69),$T$73*(1-S187)^3+$T$74*3*(1-S187)^2*S187+$T$75*3*(1-S187)*S187^2+$T$76*S187^3,1-T187^$K$28)","v":7.845454099974147E-3},0.15516715173962936,0]
[null,0.97000000000000064,{"$f":"IF(B188<$B$27,0,1)","v":1},{"$f":"IF(C188,D187+1/SUM($C$91:$C$191),0)","v":0.79999999999999993},{"$f":"IF(AND(C188,$E$69),$D$73*(1-D188)^3+$D$74*3*(1-D188)^2*D188+$D$75*3*(1-D188)*D188^2+$D$76*D188^3,B188)","v":0.97000000000000064},{"$f":"IF(AND(C188,$E$69),$E$73*(1-D188)^3+$E$74*3*(1-D188)^2*D188+$E$75*3*(1-D188)*D188^2+$E$76*D188^3,1-E188^$C$28)","v":0.16473636030590599},0.16473636030590599,0,0.97000000000000064,{"$f":"IF(I188<$F$27,0,1)","v":1},{"$f":"IF(J188,K187+1/SUM($J$91:$J$191),0)","v":0.78571428571428548},null,0.93916735931374418,{"$f":"IF(AND(J188,$M$69),$M$73*(1-K188)^3+$M$74*3*(1-K188)^2*K188+$M$75*3*(1-K188)*K188^2+$M$76*K188^3,1-M188^$G$28)","v":7.1730911121816177E-2},0.50061891012978266,0,0.97000000000000064,{"$f":"IF(Q188<$J$27,0,1)","v":1},{"$f":"IF(R188,S187+1/SUM($R$91:$R$191),0)","v":0.94736842105263297},{"$f":"IF(AND(R188,$T$69),$S$73*(1-S188)^3+$S$74*3*(1-S188)^2*S188+$S$75*3*(1-S188)*S188^2+$S$76*S188^3,Q188)","v":0.93566834587710035},{"$f":"IF(AND(R188,$T$69),$T$73*(1-S188)^3+$T$74*3*(1-S188)^2*S188+$T$75*3*(1-S188)*S188^2+$T$76*S188^3,1-T188^$K$28)","v":4.4545207887682417E-3},0.12030582379353982,0]
[null,0.98000000000000065,{"$f":"IF(B189<$B$27,0,1)","v":1},{"$f":"IF(C189,D188+1/SUM($C$91:$C$191),0)","v":0.86666666666666659},{"$f":"IF(AND(C189,$E$69),$D$73*(1-D189)^3+$D$74*3*(1-D189)^2*D189+$D$75*3*(1-D189)*D189^2+$D$76*D189^3,B189)","v":0.98000000000000065},{"$f":"IF(AND(C189,$E$69),$E$73*(1-D189)^3+$E$74*3*(1-D189)^2*D189+$E$75*3*(1-D189)*D189^2+$E$76*D189^3,1-E189^$C$28)","v":0.11254191640391431},0.11254191640391431,0,0.98000000000000065,{"$f":"IF(I189<$F$27,0,1)","v":1},{"$f":"IF(J189,K188+1/SUM($J$91:$J$191),0)","v":0.85714285714285687},null,0.95417912311153108,{"$f":"IF(AND(J189,$M$69),$M$73*(1-K189)^3+$M$74*3*(1-K189)^2*K189+$M$75*3*(1-K189)*K189^2+$M$76*K189^3,1-M189^$G$28)","v":3.3294393518555322E-2},0.40484778668275101,0,0.98000000000000065,{"$f":"IF(Q189<$J$27,0,1)","v":1},{"$f":"IF(R189,S188+1/SUM($R$91:$R$191),0)","v":0.96491228070175583},{"$f":"IF(AND(R189,$T$69),$S$73*(1-S189)^3+$S$74*3*(1-S189)^2*S189+$S$75*3*(1-S189)*S189^2+$S$76*S189^3,Q189)","v":0.95607933129312306},{"$f":"IF(AND(R189,$T$69),$T$73*(1-S189)^3+$T$74*3*(1-S189)^2*S189+$T$75*3*(1-S189)*S189^2+$T$76*S189^3,1-T189^$K$28)","v":1.9982105094670929E-3},8.2939220811837799E-2,0]
[null,0.99000000000000066,{"$f":"IF(B190<$B$27,0,1)","v":1},{"$f":"IF(C190,D189+1/SUM($C$91:$C$191),0)","v":0.93333333333333324},{"$f":"IF(AND(C190,$E$69),$D$73*(1-D190)^3+$D$74*3*(1-D190)^2*D190+$D$75*3*(1-D190)*D190^2+$D$76*D190^3,B190)","v":0.99000000000000066},{"$f":"IF(AND(C190,$E$69),$E$73*(1-D190)^3+$E$74*3*(1-D190)^2*D190+$E$75*3*(1-D190)*D190^2+$E$76*D190^3,1-E190^$C$28)","v":5.7665987427392373E-2},5.7665987427392373E-2,0,0.99000000000000066,{"$f":"IF(I190<$F$27,0,1)","v":1},{"$f":"IF(J190,K189+1/SUM($J$91:$J$191),0)","v":0.92857142857142827},null,0.97417857256096752,{"$f":"IF(AND(J190,$M$69),$M$73*(1-K190)^3+$M$74*3*(1-K190)^2*K190+$M$75*3*(1-K190)*K190^2+$M$76*K190^3,1-M190^$G$28)","v":8.6770955235203374E-3},0.2513157606566998,0,0.99000000000000066,{"$f":"IF(Q190<$J$27,0,1)","v":1},{"$f":"IF(R190,S189+1/SUM($R$91:$R$191),0)","v":0.98245614035087869},{"$f":"IF(AND(R190,$T$69),$S$73*(1-S190)^3+$S$74*3*(1-S190)^2*S190+$S$75*3*(1-S190)*S190^2+$S$76*S190^3,Q190)","v":0.97751218861928257},{"$f":"IF(AND(R190,$T$69),$T$73*(1-S190)^3+$T$74*3*(1-S190)^2*S190+$T$75*3*(1-S190)*S190^2+$T$76*S190^3,1-T190^$K$28)","v":5.0415850042593397E-4},4.2897358873091096E-2,0]
[null,1.0000000000000007,{"$f":"IF(B191<$B$27,0,1)","v":1},{"$f":"IF(C191,D190+1/SUM($C$91:$C$191),0)","v":0.99999999999999989},{"$f":"IF(AND(C191,$E$69),$D$73*(1-D191)^3+$D$74*3*(1-D191)^2*D191+$D$75*3*(1-D191)*D191^2+$D$76*D191^3,B191)","v":1.0000000000000007},{"$f":"IF(AND(C191,$E$69),$E$73*(1-D191)^3+$E$74*3*(1-D191)^2*D191+$E$75*3*(1-D191)*D191^2+$E$76*D191^3,1-E191^$C$28)","v":-3.9968028886505635E-15},-3.9968028886505635E-15,0,1.0000000000000007,{"$f":"IF(I191<$F$27,0,1)","v":1},{"$f":"IF(J191,K190+1/SUM($J$91:$J$191),0)","v":0.99999999999999967},null,0.99999999999999989,{"$f":"IF(AND(J191,$M$69),$M$73*(1-K191)^3+$M$74*3*(1-K191)^2*K191+$M$75*3*(1-K191)*K191^2+$M$76*K191^3,1-M191^$G$28)","v":1.9635198401708394E-31},0,0,1.0000000000000007,{"$f":"IF(Q191<$J$27,0,1)","v":1},{"$f":"IF(R191,S190+1/SUM($R$91:$R$191),0)","v":1.0000000000000016},{"$f":"IF(AND(R191,$T$69),$S$73*(1-S191)^3+$S$74*3*(1-S191)^2*S191+$S$75*3*(1-S191)*S191^2+$S$76*S191^3,Q191)","v":1.000000000000002},{"$f":"IF(AND(R191,$T$69),$T$73*(1-S191)^3+$T$74*3*(1-S191)^2*S191+$T$75*3*(1-S191)*S191^2+$T$76*S191^3,1-T191^$K$28)","v":3.9934011099272389E-30},-3.7747582837255322E-15,0]

{"sheet":"Summary of Building Performance","index":6,"n_rows":285,"n_cols":32,"rows_kept":285,"cut":false,"hidden":false,"merged":[[1,1,1,11],[13,1,13,19],[18,19,20,19],[34,19,36,19],[18,21,20,21],[34,21,36,21],[7,20,11,34],[20,25,20,26],[18,25,18,26],[34,25,34,26],[36,25,36,26],[18,23,20,23],[34,23,36,23]]}
[]
[null,{"$f":"IF(OR(projecttype='Assessment Details'!Z214,projecttype=\"\"),\"BREEAM International 2013 New Construction Pre-Assessment Estimator:                                Summary of Building Performance\",\"BREEAM International Bespoke 2013 New Construction Pre-Assessment Estimator:             Summary of Building Performance\")","v":"BREEAM International 2013 New Construction Pre-Assessment Estimator:                                Summary of Building Performance"}]
[null,{"$f":"IF(AD_Mandatory_fields_text=AIS_statement09,\"Warning: All Mandatory fields in the assessment details worksheet must be completed/defined to reveal the BREEAM rating and Summary of building performance.\",\"\")","v":"Warning: All Mandatory fields in the assessment details worksheet must be completed/defined to reveal the BREEAM rating and Summary of building performance."}]
[null,"Overall Building Performance"]
[]
[null,null,null,"Building name",null,{"$f":"IF(ISBLANK(ADBN),\"\",ADBN)","v":""}]
[]
[null,null,null,"Indicative BREEAM rating",null,{"$f":"IF(ISERROR(IF(AD_Mandatory_fields_text=AIS_statement09,\"\",IF(AIS_MinStand_rating_check=AIS_No,VLOOKUP(AIS_MinStandMin,AIS_MinSt_benchmarks,3,FALSE),IF(AIS_MinStand_rating_check=AIS_Yes,VLOOKUP(AIS_BREEAM_rating_level,AIS_MinSt_benchmarks,3,FALSE))))),AIS_statement49,IF(AD_Mandatory_fields_text=AIS_statement09,\"\",IF(AIS_MinStand_rating_check=AIS_No,VLOOKUP(AIS_MinStandMin,AIS_MinSt_benchmarks,3,FALSE),IF(AIS_MinStand_rating_check=AIS_Yes,VLOOKUP(AIS_BREEAM_rating_level,AIS_MinSt_benchmarks,3,FALSE)))) )","v":""},null,{"$f":"IF(ISERROR(IF(AIS_MinStand_rating_check=AIS_No,\"Note: the BREEAM rating has been pegged back to the minimum standards level achieved\",\"\")),\"\",IF(AIS_MinStand_rating_check=AIS_No,\"Note: the BREEAM rating has been limited to the minimum standards level achieved\",\"\"))","v":""},null,null,null,null,null,null,null,null,null,null,null,null,{"$f":"IF(BP_BREEAMRating=AIS_statement49,\"Note: BREEAM issue Tra03 requires building type definition in order to define the number of credits available for the transport section. Please define for Tra03 in the Assessment Issue Scoring worksheet.\",\"\")","v":""}]
[]
[null,null,null,"Indicative total score",null,{"$f":"IF(ISERROR(IF(AD_Mandatory_fields_text=AIS_statement09,\"\",BP_Man_score+BP_HW_score_unmerged+BP_Energy_score+BP_Trans_score+BP_Water_score+BP_Materials_score+BP_Waste_Score+BP_LUE_score+BP_Pol_score_unmerged+BP_Innovation_score)),AIS_statement49,IF(AD_Mandatory_fields_text=AIS_statement09,\"\",BP_Man_score+BP_HW_score_unmerged+BP_Energy_score+BP_Trans_score+BP_Water_score+BP_Materials_score+BP_Waste_Score+BP_LUE_score+BP_Pol_score_unmerged+BP_Innovation_score))","v":""}]
[]
[null,null,null,"Min. standards level achieved",null,{"$f":"IF(AD_Mandatory_fields_text=AIS_statement09,\"\",VLOOKUP(AIS_MinStandMin,AIS_MinSt_benchmarks,2,FALSE))","v":""}]
[null,"Building Performance by Environment Section"]
[]
[null,"Environmental Section",null,null,null,null,null,null,null,"No. credits available",null,"Indicative No. credits Achieved",null,"% credits achieved",null,"Section Weighting (User entry)",null,"Section Weighting (default)",null,"Section Weighting",null,"Section Score"]
[]
[null,null,null,null,null,null,null,"Management",null,{"$f":"Man01_credits+Man02_credits+Man03_credits+Man04_credits+Man05_credits","v":23},null,{"$f":"IF(Score_option=_PSc2,Man_tot_simple,Man_tot_det)","v":0},null,{"$f":"BP_11/BP_01","v":0},null,0.12,null,0.12,null,{"$f":"IF(AD_Weightings=AD_weight_Yes,BP_32u,BP_32d)","v":0.12},null,{"$f":"BP_22*T17","v":0}]
[]
[null,null,null,null,null,null,null,"Health & Wellbeing",null,{"$f":"Hea01_credits+Hea02_creditsNA+Hea03_credits+Hea04_credits+Hea05_credits+Hea06_creditsNA+Hea08_creditsNA","v":13},null,{"$f":"IF(Score_option=_PSc2,Hea01_user+Hea02_user+Hea03_user+Hea04_user+Hea05_user+Hea06_user+Hea08_user,Hea01_tot+IF(Hea02_tot=AIS_NA,0,Hea02_tot)+IF(Hea03_tot=AIS_NA,0,Hea03_tot)+Hea04_tot+Hea05_tot+Hea06_tot+Hea08_tot)","v":0},null,{"$f":"BP_12/BP_02","v":0},null,0.14000000000000001,null,0.14000000000000001,null,{"$f":"IF(AD_Weightings=AD_weight_Yes,BP_33+BP_33c,BP_33d+BP_33cd)","v":0.15000000000000002},null,{"$f":"IF(BP_02c=0,(T19*BP_23),((BP_33*BP_23)+(BP_33c*N21)))","v":0},null,"Unmerged HW score",{"$f":"BP_HW_score","v":0},"HW weighting",null,{"$f":"IF(AD_Weightings=AD_weight_Yes,BP_33u,BP_33d)","v":0.14000000000000001}]
[]
[null,null,null,null,null,null,null,"Health & Wellbeing - Hazards",null,{"$f":"IF(Hea07_Credits=AIS_NA,0,Hea07_Credits)","v":1},null,{"$f":"IF(Hea07_Tot=AIS_NA,0,IF(Score_option=_PSc2,Hea07_user,Hea07_Tot))","v":0},null,{"$f":"IF(BP_02c=0,0,L21/BP_02c)","v":0},null,0.01,null,0.01,null,null,null,null,null,null,null,"Hazards weight",null,{"$f":"IF(AD_Weightings=AD_weight_Yes,BP_33cu,BP_33cd)","v":0.01}]
[]
[null,null,null,null,null,null,null,"Energy",null,{"$f":"Ene01_credits+Ene02_credits+Ene03_credits+Ene04_credits+Ene08_credits+Ene05_creditsNA+Ene06_creditsNA+Ene09_creditsNA","v":23},null,{"$f":"IF(Score_option=_PSc2,Ene_tot_simple,Ene_tot_det)","v":0},null,{"$f":"BP_13/BP_03","v":0},null,0.19,null,0.19,null,{"$f":"IF(AD_Weightings=AD_weight_Yes,BP_34u,BP_34d)","v":0.19},null,{"$f":"BP_24*T23","v":0}]
[]
[null,null,null,null,null,null,null,"Transport",null,{"$f":"IF(ISERROR(Tra01_credits+Tra03_credits+Tra02_credits+Tra04_creditsNA+Tra05_creditsNA+Tra06_creditsNA),AIS_statement49, Tra01_credits+Tra03_credits+Tra05_creditsNA+Tra02_credits+Tra04_creditsNA+Tra06_creditsNA)","v":"See note"},null,{"$f":"IF(Score_option=_PSc2,Tra_tot_simple,Tra_tot_det)","v":0},null,{"$f":"IF(ISERROR(BP_14/BP_04),0,BP_14/BP_04)","v":0},null,0.08,null,0.08,null,{"$f":"IF(AD_Weightings=AD_weight_Yes,BP_35u,BP_35d)","v":0.08},null,{"$f":"BP_25*T25","v":0}]
[]
[null,null,null,null,null,null,null,"Water",null,{"$f":"Wat01_credits+Wat02_credits+Wat03_creditsNA+Wat04_creditsNA","v":9},null,{"$f":"IF(Score_option=_PSc2,Wat_tot_simple,Wat_tot_det)","v":0},null,{"$f":"BP_15/BP_05","v":0},null,0.06,null,0.06,null,{"$f":"IF(AD_Weightings=AD_weight_Yes,BP_36u,BP_36d)","v":0.06},null,{"$f":"BP_26*T27","v":0}]
[]
[null,null,null,null,null,null,null,"Materials",null,{"$f":"Mat01_credits+Mat03_credits+Mat04_credits+Mat05_credits","v":11},null,{"$f":"IF(Score_option=_PSc2,Mat_tot_simple,Mat_tot_det)","v":0},null,{"$f":"BP_16/BP_06","v":0},null,0.125,null,0.125,null,{"$f":"IF(AD_Weightings=AD_weight_Yes,BP_38u,BP_38d)","v":0.125},null,{"$f":"BP_27*T29","v":0}]
[]
[null,null,null,null,null,null,null,"Waste",null,{"$f":"Wst01_credits+Wst02_credits+Wst03_credits+Wst04_creditsNA","v":5},null,{"$f":"IF(Score_option=_PSc2,Wst_tot_simple,Wst_tot_det)","v":0},null,{"$f":"BP_18/BP_07","v":0},null,7.4999999999999997E-2,null,7.4999999999999997E-2,null,{"$f":"IF(AD_Weightings=AD_weight_Yes,BP_39u,BP_39d)","v":7.4999999999999997E-2},null,{"$f":"BP_28*T31","v":0}]
[]
[null,null,null,null,null,null,null,"Land Use & Ecology",null,{"$f":"LE01_credits+LE02_credits+LE04_credits+LE05_credits+LE06_creditsNA","v":10},null,{"$f":"IF(Score_option=_PSc2,Lue_tot_simple,Lue_tot_det)","v":0},null,{"$f":"BP_19/BP_08","v":0},null,0.1,null,0.1,null,{"$f":"IF(AD_Weightings=AD_weight_Yes,BP_40u,BP_40d)","v":0.1},null,{"$f":"BP_29*T33","v":0}]
[]
[null,null,null,null,null,null,null,"Pollution",null,{"$f":"IF(ISERROR(Pol01_creditsNA+Pol02_credits+Pol04_credits+Pol05_creditsNA),AIS_statement49,Pol01_creditsNA+Pol02_credits+Pol04_credits+Pol05_creditsNA)","v":9},null,{"$f":"IF(Score_option=_PSc2,Pol01_user+Pol02_user+Pol04_user+Pol05_user,IF(Pol01_tot=AIS_NA,0,Pol01_tot)+IF(Pol02_tot=AIS_NA,0,Pol02_tot)+Pol04_tot+IF(Pol05_tot=AIS_NA,0,Pol05_tot))","v":0},null,{"$f":"IF(ISERROR(BP_20/BP_09),0,BP_20/BP_09)","v":0},null,6.4000000000000001E-2,null,6.4000000000000001E-2,null,{"$f":"IF(AD_Weightings=AD_weight_Yes,BP_41+BP_41a,BP_41d+BP_41ad)","v":0.1},null,{"$f":"IF(BP_09b=0,(T35*BP_30),((BP_41*BP_30)+(BP_41a*N37)))","v":0},null,"Unmerged pol score",{"$f":"BP_Pollution_score","v":0},"Pollution weighting",null,{"$f":"IF(AD_Weightings=AD_weight_Yes,BP_41u,BP_41d)","v":6.4000000000000001E-2}]
[]
[null,null,null,null,null,null,null,"Pollution - Surface water run-off",null,{"$f":"Pol03_credits","v":5},null,{"$f":"IF(Score_option=_PSc2,Pol03_user,Pol03_tot)","v":0},null,{"$f":"IF(ISERROR(L37/J37),0,L37/J37)","v":0},null,3.5999999999999997E-2,null,3.5999999999999997E-2,null,null,null,null,null,null,null,"Surface WR weighting",null,{"$f":"IF(AD_Weightings=AD_weight_Yes,BP_41au,BP_41ad)","v":3.5999999999999997E-2}]
[]
[null,null,null,null,null,null,null,"Innovation",null,{"$f":"Inn01_credits","v":10},null,{"$f":"IF(Score_option=_PSc2,Innov_user,Inn01_tot)","v":0},null,{"$f":"BP_21/BP_10","v":0},null,0.1,null,0.1,null,0.1,null,{"$f":"BP_31*T39","v":0}]
[]
[]
[]
[]
[]
[]
[]
[]
[]
[]
[]
[]
[]
[]
[]
[]
[]
[]
[]
[]
[]
[]
[]
[]
[]
[]
[]
[]
[]
[]
[]
[]
[]
[]
[]
[]
[]
[]
[]
[]
[]
[]
[]
[]
[]
[]
[]
[]
[]
[]
[]
[]
[]
[]
[]
[]
[]
[]
[]
[]
[]
[]
[]
[]
[]
[]
[]
[]
[]
[]
[]
[]
[]
[]
[]
[]
[]
[]
[]
[]
[]
[]
[]
[]
[]
[]
[]
[]
[]
[]
[]
[]
[]
[]
[]
[]
[]
[]
[]
[]
[]
[]
[]
[]
[]
[]
[]
[]
[]
[]
[]
[]
[]
[]
[]
[]
[]
[]
[]
[]
[]
[]
[]
[]
[]
[]
[]
[]
[]
[]
[]
[]
[]
[]
[]
[]
[]
[]
[]
[]
[]
[]
[]
[]
[]
[]
[]
[]
[]
[]
[]
[]
[]
[]
[]
[]
[]
[]
[]
[]
[]
[]
[]
[]
[]
[]
[]
[]
[]
[]
[]
[]
[]
[]
[]
[]
[]
[]
[]
[]
[]
[]
[]
[]
[]
[]
[]
[]
[]
[]
[]
[]
[]
[]
[]
[]
[]
[]
[]
[]
[]
[]
[]
[]
[]
[]
[]
[]
[]
[]
[]
[]
[]
[]
[]
[]
[]
[]
[]
[]
[]
[]
[]
[]
[]
[]
[]
[]
[]
[]
[]
[]
[]
[]
[]
[]
[null,null,null,null,null,null,null,null,null,null,null,null,null,null,null,null,null,null,null,null,null,null,null,null,null,null,null,null,null,{"$f":"H17","v":"Management"},null,{"$f":"T17","v":0.12}]
[null,null,null,null,null,null,null,null,null,null,null,null,null,null,null,null,null,null,null,null,null,null,null,null,null,null,null,null,null,{"$f":"H19","v":"Health & Wellbeing"},null,{"$f":"T19","v":0.15000000000000002}]
[null,null,null,null,null,null,null,null,null,null,null,null,null,null,null,null,null,null,null,null,null,null,null,null,null,null,null,null,null,{"$f":"H23","v":"Energy"},null,{"$f":"T23","v":0.19}]
[null,null,null,null,null,null,null,null,null,null,null,null,null,null,null,null,null,null,null,null,null,null,null,null,null,null,null,null,null,{"$f":"H25","v":"Transport"},null,{"$f":"T25","v":0.08}]
[null,null,null,null,null,null,null,null,null,null,null,null,null,null,null,null,null,null,null,null,null,null,null,null,null,null,null,null,null,{"$f":"H27","v":"Water"},null,{"$f":"T27","v":0.06}]
[null,null,null,null,null,null,null,null,null,null,null,null,null,null,null,null,null,null,null,null,null,null,null,null,null,null,null,null,null,{"$f":"H29","v":"Materials"},null,{"$f":"T29","v":0.125}]
[null,null,null,null,null,null,null,null,null,null,null,null,null,null,null,null,null,null,null,null,null,null,null,null,null,null,null,null,null,{"$f":"H31","v":"Waste"},null,{"$f":"T31","v":7.4999999999999997E-2}]
[null,null,null,null,null,null,null,null,null,null,null,null,null,null,null,null,null,null,null,null,null,null,null,null,null,null,null,null,null,{"$f":"H33","v":"Land Use & Ecology"},null,{"$f":"T33","v":0.1}]
[null,null,null,null,null,null,null,null,null,null,null,null,null,null,null,null,null,null,null,null,null,null,null,null,null,null,null,null,null,{"$f":"H35","v":"Pollution"},null,{"$f":"T35","v":0.1}]
[null,null,null,null,null,null,null,null,null,null,null,null,null,null,null,null,null,null,null,null,null,null,null,null,null,null,null,null,null,{"$f":"H39","v":"Innovation"},null,{"$f":"T39","v":0.1}]

{"sheet":"Version Control","index":7,"n_rows":13,"n_cols":6,"rows_kept":13,"cut":false,"hidden":false,"merged":[[25,5,26,16],[89,5,91,16],[75,5,77,16],[79,5,82,16],[84,5,87,16],[42,5,42,16],[38,5,38,16],[40,5,40,16],[99,5,99,16],[67,5,70,16],[97,5,97,16],[95,5,95,16],[72,5,73,16],[93,5,93,16],[0,1,0,13],[52,5,59,16],[61,5,65,16],[30,5,32,16],[34,5,34,16],[36,5,36,16],[1,1,1,11],[44,5,50,16],[7,5,7,16],[28,5,28,16],[20,5,21,16],[23,5,23,16],[12,5,12,16],[14,5,14,16],[16,5,16,16],[18,5,18,16],[101,5,101,16],[130,5,130,16],[122,5,122,16],[120,5,120,16],[114,5,114,16],[110,5,112,16],[128,5,128,16],[107,5,108,16],[126,5,126,16],[118,5,118,16],[103,5,103,16],[124,5,124,16],[116,5,116,16],[105,5,105,16]]}
[]
[null,{"$f":"IF(OR(projecttype='Assessment Details'!Z214,projecttype=\"\"),\"BREEAM International 2013 New Construction Pre-Assessment Estimator:                 Version Control\",\"BREEAM International Bespoke 2013 New Construction Pre-Assessment Estimator: Version Control\")","v":"BREEAM International 2013 New Construction Pre-Assessment Estimator:                 Version Control"}]
[]
[null,"Version",null,"Release Date",null,"Description of changes/additions made to the BREEAM Assessment Scoring and Reporting Tool"]
[]
[null,"Current Version"]
[]
[null,1,null,"2013-10-19",null,"Initial Release Version of BREEAM International New Construction 2013 Pre-Assessment Tool"]
[]
[null,"Previous Versions"]
[]
[]
[null,"N/A",null,"N/A",null,"N/A"]